MF-core.owl
type: Ontology
imports: bfo-properties-slim.owl
imports: ontology-metadata.owl
comment: Core mental functioning ontology classes and properties.
comment: To be imported into the full MF.owl

BFO_0000052
type: ObjectProperty
TV pl: BFO_0000052
TV sg: BFO_0000052s
TV vbg: BFO_0000052ed

BFO_0000055
type: ObjectProperty
TV pl: BFO_0000055
TV sg: BFO_0000055s
TV vbg: BFO_0000055ed

BFO_0000057
type: ObjectProperty
TV pl: BFO_0000057
TV sg: BFO_0000057s
TV vbg: BFO_0000057ed

BFO_0000107
type: ObjectProperty
TV pl: BFO_0000107
TV sg: BFO_0000107s
TV vbg: BFO_0000107ed

BFO_0000112
type: ObjectProperty
TV pl: BFO_0000112
TV sg: BFO_0000112s
TV vbg: BFO_0000112ed

BFO_0000117
type: ObjectProperty
TV pl: BFO_0000117
TV sg: BFO_0000117s
TV vbg: BFO_0000117ed

BFO_0000132
TV pl: BFO_0000132
TV sg: BFO_0000132s
TV vbg: BFO_0000132ed

BFO_0000167
type: ObjectProperty
TV pl: BFO_0000167
TV sg: BFO_0000167s
TV vbg: BFO_0000167ed

BFO_0000176
TV pl: BFO_0000176
TV sg: BFO_0000176s
TV vbg: BFO_0000176ed

remembering
type: Class
subclass of: mental process
IAO_0000115: (for the case of remembering X, where X is an event in the organism’s history) a mental process that is a) about X, and b) made possible by the physical traces left by a causal process involving the organism during the event X
IAO_0000118: act of remembering

alertness
type: Class
subclass of: attending
IAO_0000115: State of active attention by high sensory awareness such as being watchful and prompt to meet danger or emergency, or being quick to perceive and act. http://en.wikipedia.org/wiki/Alertness
IAO_0000118: state of alertness
prior version: MFOMD_0000176

mental counting
type: Class
subclass of: cognitive process
IAO_0000115: A cognitive process that involves the mental representation of sequential numbers.

mental calculation
type: Class
subclass of: cognitive process
IAO_0000115: A cognitive process that involves the manipulation of mental representations of numeric entities in order to compute the outcome of a mathematical function.

judging
type: Class
subclass of: mental process
IAO_0000115: A mental process during which information is evaluated, the outcome of which is a belief or opinion.
IAO_0000118: act of judging

determining gender
type: Class
subclass of: judging
IAO_0000115: A judging that involves forming an opinion about the gender of a person.

cognitive process
type: Class
subclass of: mental process
subclass of: Restriction
  on property: BFO_0000167
  some values from: cognitive representation
IAO_0000115: A mental process that creates, modifies or has as participant some cognitive representation.
see also: GO:0050890, cognition, defined as `The operation of the mind by which an organism becomes aware of objects of thought or perception; it includes the mental activities associated with thinking, learning, and memory.'

determining orientation
type: Class
subclass of: judging
IAO_0000115: A judging that involves the determination of the orientation of some object.

mathematical problem solving behavior
type: Class
subclass of: problem solving behaviour

visual problem solving behavior
type: Class
subclass of: problem solving behaviour

arousal
type: Class
subclass of: mental process
IAO_0000115: A mental process that is the psychological and physiological state of being awake and reactive to stimuli.
prior version: MFOMD_0000146

thinking
type: Class
subclass of: mental process
IAO_0000115: a mental process that involves the manipulation of mental language and/or mental images
IAO_0000118: act of thinking

language problem solving behavior
type: Class
subclass of: problem solving behaviour

imagination
type: Class
subclass of: mental process
IAO_0000115: A mental process that manipulates mental images and words that go beyond mere memory and thoughts about the objects and entities that the person has encountered, to visualise or consider entities and states of affairs that the person has never encountered and which may not yet exist or obtain in the world. Imagination is the capacity to produce images, ideas and sensations in the mind without any immediate input of the senses.
IAO_0000119: https://en.wikipedia.org/wiki/Imagination

human being
type: Class
subclass of: extended organism
IAO_0000115: An extended organism that is a member of the species Homo sapiens.
IAO_0000118: person

consciousness
type: Class
subclass of: Restriction
  on property: BFO_0000055
  some values from: intentional modality
subclass of: Restriction
  on property: BFO_0000132
  some values from: Class
    intersection of: mental process
    intersection of: Class
      complement of: consciousness
subclass of: Restriction
  on property: BFO_0000167
  some values from: intentionality
IAO_0000115: Consciousness is an inseparable part of all mental processes. It is that part of the mental process that: a) confers a subjective perspective, a phenomenology, an experience of the mental process of which it is a part; and b) intends the object or event that the mental process is about, should such exist; i.e., it confers intentionality on the mental process.
comment: Note that while there are different modes of consciousness corresponding to the different senses, the whole of conscious experience at any one time is largely experienced as a unity, that is, as a fused whole. Mental processes which are simultaneously ongoing are separable only in fiat, not in essence.

attending
type: Class
subclass of: mental process
IAO_0000115: the process whereby relevant aspects of our mental experience are focused on specific targets

perception
type: Class
subclass of: mental process
IAO_0000115: A mental process which is a) produced by a causal process involving a part of the environment of the organism, and b) is experienced by the organism as being so caused, and c) in which the relevant part of the environment is thereby represented to the organism.
comment: Examples for 'causal processes involving a part of the environment of an organism' that can be perceived are light rays and air vibrations.

mental process
type: Class
subclass of: bodily process
subclass of: Restriction
  on property: BFO_0000055
  some values from: mental disposition
subclass of: Restriction
  on property: BFO_0000117
  some values from: consciousness
IAO_0000115: A bodily process that occurs in the brain, and that can of itself be conscious, or can give rise to a process that can of itself be conscious or can give rise to behaviour.
comment: A 'mental process' is a subclass of 'bodily process', as mental processes occur within the body, specifically involving the brain.
comment: A bodily process which brings into being, sustains or modifies a cognitive representation or a behavior inducing state.
comment: Examples include thinking, feeling pain, remembering and emotion as occurrent experiences.
comment: Mental processes can varying in the degree to which they involve consciousness.
see also: GO:0050890, cognition, defined as `The operation of the mind by which an organism becomes aware of objects of thought or perception; it includes the mental activities associated with thinking, learning, and memory.'

interpersonal process
type: Class
subclass of: Restriction
  on property: BFO_0000167
  min qualified cardinality: 2
  on class: human being
IAO_0000115: A process in which at least two human beings are agents.
IAO_0000119: http://www.jbiomedsem.com/content/1/1/10

agreeableness
type: Class
subclass of: personality trait
IAO_0000115: A personality trait manifesting itself in individual behavioral characteristics that are perceived as kind, sympathetic, cooperative, warm, and considerate.
IAO_0000119: Development and Validation of International English Big-Five Mini-Markers. Edmund R. Thomspson. Personality and Individual Differences, Volume 45, Issue 6, October 2008. http://www.sciencedirect.com/science/article/pii/S0191886908002195
comment: Associated adjectives: appreciative, forgiving, generous, kind, sympathetic, and trusting.

interpersonal behavior
type: Class
subclass of: Restriction
  on property: BFO_0000117
  some values from: interpersonal process
IAO_0000115: Behavior having interpersonal processes as parts, each involving the same instances of human being.
IAO_0000119: http://www.jbiomedsem.com/content/1/1/10
see also: GO:0051705, multi-organism behaviour, defined as: "Any process in which an organism has a behavioral effect on another organism of the same or different species" (http://amigo.geneontology.org/cgi-bin/amigo/term_details?term=GO:0051705#lineage)

seeing
type: Class
subclass of: perception
subclass of: Restriction
  on property: BFO_0000117
  some values from: visual consciousness
IAO_0000115: Seeing (visual perception) is a mental process that is a) produced by a causal process involving light rays from a part of the environment of the subject being absorbed by photoreceptors in the retina, and b) is experienced by the subject as being so caused, and c) in which the relevant part of the environment is thereby represented to the subject
IAO_0000118: act of seeing
IAO_0000118: visual perception

intelligence
type: Class
subclass of: mental capability
IAO_0000115: A mental capability realised in processes involving understanding complex ideas, adapting effectively to the environment, learning from experience, engaging in various forms of reasoning, and overcome obstacles through the outcome of thinking processes.

introversion
type: Class
subclass of: personality trait

planning
type: Class
subclass of: mental process
IAO_0000115: A mental process that involves mentally manipulating representations of steps in an imagined process which has some goal.
IAO_0000118: act of planning
comment: The outcome of this mental process is a plan which has the potential to be followed to bring about the desired outcome.

conscientiousness
type: Class
subclass of: personality trait
IAO_0000115: A personality trait manifesting itself in individual behavioral characteristics that are perceived as careful, self-disciplined, dependable, vigilant, dutiful, and goal-oriented.
comment: Associated adjectives: efficient, organized, planful, reliable, responsible, and thorough.

irascibility
type: Class
subclass of: personality trait
IAO_0000115: A mental disposition to frequent or easily incited outbursts of anger.

representation
type: Class
IAO_0000115: A dependent continuant which is about a portion of reality.
IAO_0000119: http://www.jbiomedsem.com/content/1/1/10

cognitive representation
type: Class
subclass of: representation
IAO_0000115: A representation which specifically depends on an anatomical structure in the cognitive system of an organism.
IAO_0000119: http://www.jbiomedsem.com/content/1/1/10

bodily disposition
type: Class
equivalent class: Restriction
  on property: BFO_0000052
  some values from: extended organism
IAO_0000115: A bodily disposition is a disposition that inheres in some extended organism. Examples are: my disposition to catch a cold when exposed to a virus, my ability to speak the English language.
comment: Bodily disposition includes features that can be used in a specific context, such as a person's strength, but not a person's weight. A person has a specific weight independent of the circumstances they are in.
comment: Extended organism refers to an organism and its microbiome (e.g., the bacteria that live in one's digestive system).

mental disposition
type: Class
subclass of: bodily disposition
subclass of: Restriction
  on property: BFO_0000054
  all values from: mental process
IAO_0000115: A mental disposition is a bodily disposition that is realized in a mental process.
comment: 'Mental disposition' is a subclass of 'bodily disposition', as mental dispositions occur in the body.

visual consciousness
type: Class
subclass of: direct consciousness
IAO_0000115: Visual consciousness is consciousness of a visual stimulus, as experienced through the visual sensory medium as a part of a process of seeing.

auditory consciousness
type: Class
subclass of: direct consciousness
IAO_0000115: Auditory consciousness is consciousness of an auditory stimulus, as a part of a conscious process of hearing.

tactile consciousness
type: Class
subclass of: direct consciousness
IAO_0000115: Tactile consciousness is consciousness that is experienced in the tactile sensory medium, through the sensory medium of touch and pressure sensation.

direct consciousness
type: Class
subclass of: consciousness
IAO_0000115: Direct consciousness is consciousness of phenomenal experience, it is the given experience in consciousness of (for example) sounds, tastes, emotions and bodily feelings.
IAO_0000118: pre-reflexive consciousness

hearing
type: Class
subclass of: perception
subclass of: Restriction
  on property: BFO_0000117
  some values from: auditory consciousness
IAO_0000115: Hearing (auditory perception) is a mental process that is a) produced by a causal process involving sound waves from a part of the environment of the subject being absorbed by detectors in the ear, and b) is experienced by the subject as being so caused, and c) in which the relevant part of the environment is thereby represented to the subject
IAO_0000118: act of hearing
IAO_0000118: auditory perception

affective representation
type: Class
subclass of: cognitive representation
IAO_0000115: A cognitive representation sustained by an organsim about its own emotions.
IAO_0000119: http://www.jbiomedsem.com/content/1/1/10

communication
type: Class
subclass of: interpersonal process
IAO_0000115: A communication process is an interpersonal process that involves the transmission of information between two organisms.

belief
type: Class
subclass of: mental disposition
IAO_0000115: A mental disposition to represent a proposition to be true.
comment: Judging is a mental process that brings a belief into existence. Judging differently may also bring that belief out of existence. An act of believing is just thinking about a belief. Beliefs typically cause us to behave in ways that are characteristic with the content of that belief. However, this is not a necessary feature for the existence of the belief.

preference
type: Class
subclass of: personality trait

capability
type: Class
subclass of: bodily disposition
IAO_0000115: A bodily disposition whose realization ordinarily brings benefits to an organism or group of organisms, where "ordinarily" means within a typical range or context.
IAO_0000118: personal capability
IAO_0000119: https://github.com/NCOR-US/Capabilities/wiki/The-Account-of-Capabilities
comment: Note that, as discussed in https://philpapers.org/archive/MERMC.pdf, both organisms and artifacts can bear capabilities. However, this capability class is just applicable to organismal capabilities (as a subclass of 'bodily disposition') and the definition has been amended from that of the definition source accordingly.
comment: The phrase 'ordinarily brings benefits to an organism or group of organism' is used to explain that capabilities normally provide a benefit. For exampoe, having a musical ability is usually an ability that is positive for a person (e.g., they enjoy playing music, they receive positive feedback about their ability). However, in certain exceptional cases (e.g., a neighbour becoming annoyed with a person playing the piano and expressing this annoyance), the ability might not bring benefits.

musical capability
type: Class
subclass of: capability
IAO_0000115: A capability that is realised in an activity of producing or interpreting music.

wanting
type: Class
subclass of: mental process
IAO_0000115: A mental process that involves thinking about a state of affairs that is not yet the case together with a desire for that state of affairs to come about.
IAO_0000118: act of wanting

capability to play piano
type: Class
subclass of: musical capability
IAO_0000115: A musical capability that is realised in the production of music using a piano.

capability to play violin
type: Class
subclass of: musical capability
IAO_0000115: A musical capability that is realised in the production of music using a violin.

mental capability
type: Class
subclass of: capability
IAO_0000115: A personal capability that includes mental processes in its realisation.

capability to read
type: Class
subclass of: linguistic capability
IAO_0000115: A linguistic capability that is realised by processes in which textual concretisations of linguistic expressions are processed and understood.

linguistic capability
type: Class
subclass of: mental capability
IAO_0000115: A mental capability that is realised in processes of communication involving language or in expressions of language.

capability to understand language
type: Class
subclass of: linguistic capability
IAO_0000115: A linguistic capability that is realised in processes in which well-formed expressions in a given language are understood.

capability to speak
type: Class
subclass of: linguistic capability
IAO_0000115: A linguistic capability that is realised in processes in which well-formed vocal expressions in a given language are produced.

capability to read music
type: Class
subclass of: musical capability
IAO_0000115: A musical capability that is the ability to interpret the musical instructions represented in a musical score.

tasting
type: Class
subclass of: perception
IAO_0000115: Taste perception is a mental process which is a) produced by a causal process involving xenobiotic molecules from a part of the environment of the subject binding with specialized sensory cells in the tongue and nasal cavity, and b) is experienced by the subject as being so caused, and c) in which the relevant part of the environment is thereby represented to the subject
IAO_0000118: act of tasting

smelling
type: Class
subclass of: perception
subclass of: Restriction
  on property: BFO_0000117
  some values from: olfactory consciousness
IAO_0000115: Smelling (olfactory perception) is a mental process which is a) produced by a causal process involving xenobiotic molecules from a part of the environment of the subject binding with specialized sensory cells in the nasal cavity, and b) is experienced by the subject as being so caused, and c) in which the relevant part of the environment is thereby represented to the subject
IAO_0000118: act of smelling
IAO_0000118: olfactory perception

touching
type: Class
subclass of: perception
subclass of: Restriction
  on property: BFO_0000117
  some values from: tactile consciousness
IAO_0000115: Touching (tactile perception) is a mental process which is a) produced by a causal process involving pressure on the organism’s skin from a part of the environment of the subject, and b) is experienced by the subject as being so caused, and c) in which the relevant part of the environment is thereby represented to the subject
IAO_0000118: act of touching

thinking with language
type: Class
subclass of: cognitive process
subclass of: thinking
IAO_0000115: A cognitive process that involves the manipulation of mental language.

attachment
type: Class
subclass of: interpersonal process
IAO_0000115: Affectional tie that one person or animal forms between himself and another specific one, a tie that binds them together emotionally and endures over time.
prior version: MFOMF_0000177

daydreaming
type: Class
subclass of: mental process
IAO_0000115: Short-term detachment from one's immediate surroundings, during which a person's contact with reality is blurred and partially substituted by a visionary fantasy, especially one of happy, pleasant thoughts, hopes or ambitions, imagined as coming to pass, and experienced while awake.
IAO_0000118: act of daydreaming
IAO_0000119: http://en.wikipedia.org/wiki/Daydream
prior version: MFOMD_0000148

vigilance
type: Class
subclass of: attending
IAO_0000115: The ability to maintain attention and alertness over prolonged periods of time. http://en.wikipedia.org/wiki/Vigilance_%28psychology%29
IAO_0000118: state of vigilance
prior version: MFOMD_0000140

orgasm
type: Class
subclass of: mental process
IAO_0000115: Orgasm is the sudden discharge of accumulated sexual tension during the sexual response cycle, resulting in rhythmic muscular contractions in the pelvic region characterized by sexual pleasure. http://en.wikipedia.org/wiki/Orgasm
IAO_0000118: sexual climax
prior version: MFOMD_0000207

libido
type: Class
subclass of: mental process
IAO_0000115: The psychic energy that drives individuals toward sensual pleasures of all types, especially sexual ones. http://www.apa.org/research/action/glossary.aspx
prior version: MFOMD_0000130

extraversion
type: Class
subclass of: personality trait
IAO_0000115: A personality trait manifesting itself in individual behavioral characteristics that are perceived as positive, assertive, social, and outgoing.
comment: Associated Adjectives: active, assertive, energetic, enthusiastic, outgoing, talkative.

neuroticism
type: Class
subclass of: personality trait
IAO_0000115: A personality trait manifesting itself in individual behavioral characteristics that are perceived as angry, anxious, depressed, unstable, and vulnerable.
comment: Associated adjectives: anxious, self-pitying, tense, touchy unstable, and worrying.

openness to experience
type: Class
subclass of: personality trait
IAO_0000115: A personality trait manifesting itself in individual behavioral characteristics that are perceived as revealing, curiosity, an appreciation of novelty and variety of experiences and ideas, invention, and unpredictability.
comment: Associated adjectives: artistic, curious, imaginative, insightful, original, and wide interests.

olfactory consciousness
type: Class
subclass of: direct consciousness
IAO_0000115: Olfactory consciousness is consciousness of an olfactory stimulus (scent), as experienced through the olfactory sensory medium as a part of a process of smelling.

consciousness of self
type: Class
subclass of: higher order consciousness
IAO_0000115: Consciousness of self is the higher order consciousness that reflexively includes the awareness that the organism that is the subject of the conscious experience exists.
IAO_0000118: consciousness of the existence of the self
IAO_0000118: self-consciousness
IAO_0000118: selfhood
comment: The implication of Descartes' famous "Cogito ergo sum" is that awareness of one's own existence entails that one exists. This is because consciousness creates a perspective, and awareness of this is a self-reflexive perspective of oneself. This is one aspect of intentionality that cannot fail. Intentionality can fail at all levels of content, but not at the level of intending through awareness the existence of the self that is consciously intending.

proprioception
type: Class
subclass of: perception
IAO_0000115: Proprioception is a mental process which is a) produced by a causal process specialized internal sensory cells in, for example, skin, muscles and joints, and b) by which their location and state of motion and/or balance are represented to the organism, and c) which is experienced by the subject as being so caused

nociception
type: Class
subclass of: perception
IAO_0000115: Nociception is a mental process which is a) produced by a causal process specialized internal sensory cells in, for example, skin, muscles and joints, and b) by which actual or immanent tissue damage are reported to the organism, and c) which is experienced by the subject as being so caused

a memory
type: Class
subclass of: mental disposition
IAO_0000115: A memory is a mental disposition that is realized in a process of remembering, i.e. a memory of X is a disposition realized in the process of remembering X.

problem solving behaviour
type: Class

consciousness of time
type: Class
subclass of: higher order consciousness
IAO_0000115: The subjective experience of time as a coherent process inhabited by oneself as an embodied thinking being
IAO_0000118: time awareness

intentionality
type: Class
subclass of: mental quality
IAO_0000115: Intentionality is the fundamental quality of conscious mental processes of always having content, of being directed towards, or about something.

bodily quality
type: Class
IAO_0000115: A bodily quality is a quality that inheres in some extended organism.

mental quality
type: Class
subclass of: bodily quality
IAO_0000115: A mental quality is a bodily quality that inheres in those structures of the extended organism that are essential for mental functioning.

intentional modality
type: Class
subclass of: mental disposition
IAO_0000112: An example of an intentional modality is the capacity to represent objects of intentionality as unfolding in time or being time contingent.
IAO_0000115: A structural capacity that shapes how an object of intentionality is represented for the subject.
IAO_0000118: intentional mode
IAO_0000118: intentional structure

consciousness of space
type: Class
subclass of: higher order consciousness
IAO_0000115: The subjective experience of the spatial surroundings one inhabits as an embodied entity.
IAO_0000118: space awareness

consciousness of the body
type: Class
subclass of: higher order consciousness
IAO_0000115: The subjective experience of being an embodied entity.
IAO_0000118: body awareness

intersubjectivity
type: Class
subclass of: higher order consciousness
IAO_0000115: The subjective experience of other beings as self-aware entities.

time intentional modality
type: Class
subclass of: intentional modality
subclass of: Restriction
  on property: BFO_0000054
  some values from: consciousness of time
IAO_0000115: The intentional structural capacity to experience lived time.

protention
type: Class
subclass of: time intentional modality
IAO_0000115: The partial structure of time consciousness that relates to linking and projecting the content of immediate moments to future moments (e.g. how the path of a moving object is intuitively projected).

retention
type: Class
subclass of: time intentional modality
IAO_0000115: The partial structure of time consciousness that relates to retaining past events in memory and linking them to present events (e.g. how the individual tones in a melody is intuitively linked together to form a whole).

mental imagery
type: Class
subclass of: imagination
IAO_0000115: A mental process that evokes the representation of the sensory characteristics of objects or events when these are not immediately present to the senses.

spoken communication
type: Class
subclass of: linguistic communication
IAO_0000115: A spoken communication process is a linguistic communication process that: (a) involves as participant at least two linguistically capable organisms; (b) one of whom produces an utterance that is well-formed in a given spoken language; (c) the other of whom perceives and understands that utterance by virtue of their recognition of the meaning of the utterance through their knowledge of the language.

written communication
type: Class
subclass of: linguistic communication
IAO_0000115: A written communication process is an interpersonal process that: (a) involves as participant at least two organisms, (b) one of whom produces a message in writing that is well-formed in a given language; (c) the other of whom reads the message and understands it.

linguistic communication
type: Class
subclass of: communication
IAO_0000115: A linguistic communication process is a communication process in which the information that is communicated is encoded in language.

gestural communication
type: Class
subclass of: non-linguistic communication
IAO_0000115: A gestural communication process is a communication process in which information is transferred by means of physical movements.

subliminal process
type: Class
subclass of: bodily process
IAO_0000115: A mental process that involves neuronal activity in response to a sensory stimuli but which is not the subject of consciousness.

non-linguistic communication
type: Class
subclass of: communication
IAO_0000115: A communication process in which information is transmitted without being encoded in the meaning units of any language.

sign-language communication
type: Class
subclass of: linguistic communication
IAO_0000115: A linguistic communication in which the meaning units are encoded in a sign language.

facial expression communication
type: Class
subclass of: non-linguistic communication
IAO_0000115: A non-linguistic communication process that involves the transmission of information by one participant interpreting the facial expressions of another participant.

higher order consciousness
type: Class
subclass of: consciousness
IAO_0000115: Higher order consciousness is consciousness of one's own mental states, a self-reflexive consciousness of the experience of being conscious, of having mental processes ongoing.

personality
type: Class
subclass of: bodily disposition
IAO_0000115: A personality is a complex sum of dispositions and predispositions towards mental processes and behaviour. It inheres in a person.
comment: Personality is not the same as mood, although a person may have a personality that includes a predisposition to moods of certain types, moods may come and go but a personality stays relatively constant, not appearing and disappearing. Personality typically changes slowly over time.

personality trait
type: Class
subclass of: bodily disposition
subclass of: Restriction
  on property: BFO_0000176
  some values from: personality
IAO_0000115: A personality trait is an individual disposition or predisposition that forms part of an overall personality and is realized in repeated occurrences of a specific mental process type or behavioural profile.

bodily process
type: Class
subclass of: Restriction
  on property: BFO_0000167
  some values from: extended organism
IAO_0000115: A process in which at least one bodily component of an organsim participates.
IAO_0000119: http://www.jbiomedsem.com/content/1/1/10
comment: From OGMS: http://purl.obolibrary.org/obo/OGMS_0000060

extended organism
type: Class
comment: From OGMS: http://purl.obolibrary.org/obo/OGMS_0000087

BFO_0000110
TV vbg: BFO_0000110ed
TV sg: BFO_0000110s
TV pl: BFO_0000110