shrimp allergy
type: Class
subclass of: crustacean allergy
IAO_0000115: A crustacean allergy that has_allergic_trigger shrimp.
IAO_0000412: doid.owl

Chlamydia pneumonia
type: Class
subclass of: bacterial pneumonia
IAO_0000115: A bacterial pneumonia has_material_basis_in Chlamydia pneumoniae.
IAO_0000412: doid.owl

Streptococcus pneumonia
type: Class
subclass of: bacterial pneumonia
IAO_0000115: A bacterial pneumonia has_material_basis_in Streptococcus pneumoniae.
IAO_0000412: doid.owl

bacterial sepsis
type: Class
subclass of: bacterial infectious disease
IAO_0000115: A bacterial infectious disease has_material_basis_in Bacteria.
IAO_0000412: doid.owl

seminal vesicle acute gonorrhea
type: Class
subclass of: gonococcal seminal vesiculitis
IAO_0000115: A gonococcal seminal vesiculitis that is characterized by back pain, perineal pain, pain with ejaculation, hematospermia and voiding symptoms resulting from inflammation located_in the seminal vesicles caused by Neisseria gonorrhoeae infection.
IAO_0000412: doid.owl

human granulocytic anaplasmosis
type: Class
subclass of: ehrlichiosis
IAO_0000115: An ehrlichiosis that results in infection located in granular leukocyte, has_material_basis_in Anaplasma phagocytophilum, which is transmitted by lone star tick (Amblyomma americanum). The infection has symptom headache, has symptom muscle aches, has symptom fatigue, has symptom fever and has symptom rash.
IAO_0000412: doid.owl

human monocytic ehrlichiosis
type: Class
subclass of: ehrlichiosis
IAO_0000115: An ehrlichiosis that results in infection located in monocyte or located in macrophage, has_material_basis_in Ehrlichia chaffeensis, which is transmitted by black-legged tick (Ixodes scapularis), transmitted by western black-legged tick (Ixodes pacificus) or transmitted by castor bean tick (Ixodes ricinus). The infection has symptom headache, has symptom muscle aches, has symptom fatigue, has symptom fever and has symptom rash.
IAO_0000412: doid.owl

African tick-bite fever
type: Class
subclass of: spotted fever
IAO_0000115: A spotted fever that has_material_basis_in Rickettsia africae, which is transmitted_by ticks (Amblyomma hebraeum and Amblyomma variegatum). The infection has_symptom fever, has_symptom eschar and has_symptom maculopapular rash.
IAO_0000412: doid.owl

Astrakhan spotted fever
type: Class
subclass of: spotted fever
IAO_0000115: A spotted fever that has_material_basis_in Rickettsia conorii subsp caspia, which is transmitted_by ticks (Rhipicephalus pumilio and Rhipicephalus sanguineus). The infection has_symptom fever, has_symptom eschar (usually single), has_symptom regional adenopathy, has_symptom maculopapular rash on extremities.
IAO_0000412: doid.owl

Indian tick typhus
type: Class
subclass of: spotted fever
IAO_0000115: A spotted fever that has_material_basis_in Rickettsia conorii subsp indica, which is transmitted_by ticks (Rhipicephalus sanguineus). The infection has_symptom fever, has_symptom eschar, has_symptom regional adenopathy, and has_symptom maculopapular rash on extremities.
IAO_0000412: doid.owl

Israeli tick typhus
type: Class
subclass of: spotted fever
IAO_0000115: A spotted fever that has_material_basis_in Rickettsia conorii subsp israelensis, which is transmitted_by ticks (Rhipicephalus sanguineus). The infection has_symptom fever, has_symptom eschar, has_symptom regional adenopathy, and has_symptom maculopapular rash on extremities.
IAO_0000412: doid.owl

Far Eastern spotted fever
type: Class
subclass of: spotted fever
IAO_0000115: A spotted fever that has_material_basis_in Rickettsia heilongjiangensis, which is transmitted_by ticks (Haemaphysalis concinna). The infection has_symptom fever, has_symptom eschar, has_symptom maculopapular rash, and has_symptom regional adenopathy.
IAO_0000412: doid.owl

Flinders Island spotted fever
type: Class
subclass of: spotted fever
IAO_0000115: A spotted fever that has_material_basis_in Rickettsia honei, which is transmitted_by cayenne ticks (Amblyomma cajennense). The infection has_symptom mild spotted fever, has_symptom eschar and has_symptom adenopathy.
IAO_0000412: doid.owl

Japanese spotted fever
type: Class
subclass of: spotted fever
IAO_0000115: A spotted fever that has_material_basis_in Rickettsia japonica, which is transmitted_by ticks (Dermacentor taiwanensis and Haemaphysalis flava). The infection has_symptom fever, has_symptom eschars, has_symptom regional adenopathy, and has_symptom rash on extremities.
IAO_0000412: doid.owl

Rickettsia parkeri spotted fever
type: Class
subclass of: spotted fever
IAO_0000115: A spotted fever that has_material_basis_in Rickettsia parkeri, which is transmitted_by Gulf Coast tick (Amblyomma maculatum). The infection has_symptom fever, has_symptom headache, has_symptom eschar, and has_symptom rash.
IAO_0000412: doid.owl

Rocky Mountain spotted fever
type: Class
subclass of: spotted fever
IAO_0000115: A spotted fever that has_material_basis_in Rickettsia rickettsii, which is transmitted_by ticks (Dermacentor variabilis and Dermacentor andersoni). The infection has_symptom fever, has_symptom headache, has_symptom abdominal pain, and has_symptom maculopapular rash progressing into papular or petechial rash.
IAO_0000412: doid.owl

oropharyngeal anthrax
type: Class
subclass of: gastrointestinal anthrax
IAO_0000115: A gastrointestinal anthrax that results in infection located in mucosa of oropharynx, has_material_basis_in Bacillus anthracis, which is transmitted by ingestion of anthrax-infected meat. The infection has symptom lesions, has symptom vomiting of blood, has symptom severe diarrhea, has symptom loss of appetite.
IAO_0000412: doid.owl

erysipeloid
type: Class
subclass of: primary bacterial infectious disease
IAO_0000115: A primary bacterial infectious disease that results_in infection located_in skin, has_material_basis_in Erysipelothrix rhusiopathiae, which is transmitted_by contact with infected animals. The infection has_symptom redness of skin, has_symptom tenderness of skin and has_symptom warmth of skin.
IAO_0000412: doid.owl

disease by infectious agent
type: Class
subclass of: disease
IAO_0000115: A disease that is the consequence of the presence of pathogenic microbial agents, including pathogenic viruses, pathogenic bacteria, fungi, protozoa, multicellular parasites, and aberrant proteins known as prions.
IAO_0000412: doid.owl

intestinal botulism
type: Class
subclass of: botulism
IAO_0000115: A botulism that involves intoxication caused by botulinum neurotoxins (BoNTA, B, E and F) in adults, has_material_basis_in Clostridium botulinum A, has_material_basis_in Clostridium botulinum B, has_material_basis_in Clostridium botulinum E and has_material_basis_in Clostridium botulinum F, which are transmitted by ingestion of bacterial spores, which then grow in the intestine and release toxins.
IAO_0000412: doid.owl

Pontiac fever
type: Class
subclass of: legionellosis
IAO_0000115: A legionellosis that involves a milder respiratory illness without pneumonia. Symptoms include fever, headache and muscle aches which last for 2 to 5 days.
IAO_0000412: doid.owl

aspiration pneumonia
type: Class
subclass of: bacterial pneumonia
IAO_0000115: A bacterial pneumonia which is an acute pulmonary inflammatory response that develops after the inhalation of colonized oropharyngeal material containing bacteria. It is seen in individuals with dysphagia and gastric dysmotility. The disease has_symptom tachypnea and has_symptom cough.
IAO_0000412: doid.owl

sensory system disease
type: Class
subclass of: nervous system disease
IAO_0000115: A nervous system disease which is located in a part of the nervous system responsible for processing sensory information that consists of sensory receptors, neural pathways, and parts of the brain involved in sensory perception. Commonly recognized sensory systems are those for vision, hearing, somatic sensation (touch), taste and olfaction (smell).
IAO_0000412: doid.owl

inhalation anthrax
type: Class
subclass of: anthrax disease
IAO_0000115: An anthrax disease that results in infection located in lung lymph nodes brought on by breathing in the spores of the bacteria Bacillus anthracis. The first symptoms of inhalation anthrax are like cold or flu symptoms and can include a sore throat, mild fever and muscle aches. Later symptoms include cough, chest discomfort, shortness of breath, tiredness and muscle aches.
IAO_0000412: doid.owl

lower respiratory tract disease
type: Class
subclass of: respiratory system disease
IAO_0000115: A respiratory system disease which involves the lower respiratory tract.
IAO_0000412: doid.owl

tuberculous salpingitis
type: Class
subclass of: fallopian tube disease
subclass of: urogenital tuberculosis
IAO_0000115: An urogenital tuberculosis that results_in formation of granulomas located_in fallopian tube.
IAO_0000412: doid.owl

primary bacterial infectious disease
type: Class
subclass of: bacterial infectious disease
IAO_0000115: A bacterial infectious disease that results_in infection by bacteria as a result of their presence or activity within the normal, healthy host, and their intrinsic virulence is, in part, a necessary consequence of their need to reproduce and spread.
IAO_0000412: doid.owl

commensal bacterial infectious disease
type: Class
subclass of: bacterial infectious disease
IAO_0000115: A bacterial infectious disease that results_in infection by bacteria which are part of the normal human flora when one or more of the defense mechanisms designed to restrict them from the usually sterile internal tissues are breached by accident, by intent (surgery), or by an underlying metabolic or an infectious disorder.
IAO_0000412: doid.owl

opportunistic bacterial infectious disease
type: Class
subclass of: bacterial infectious disease
IAO_0000115: A bacterial infectious disease that results_in infection by bacteria in individuals whose host defense mechanisms have been compromised.
IAO_0000412: doid.owl

foodborne botulism
type: Class
subclass of: botulism
IAO_0000115: A botulism that involves intoxication caused by botulinum neurotoxins (BoNTA, B, E and F), which are transmitted by ingestion of food contaminated with preformed toxins, has_material_basis_in Clostridium botulinum A, has_material_basis_in Clostridium botulinum B, has_material_basis_in Clostridium botulinum E and has_material_basis_in Clostridium botulinum F. The infection has symptom blurred vision, has symptom diplopia, has symptom dysarthria, has symptom dysphonia, has symptom dysphagia and has symptom descending muscle paralysis.
IAO_0000412: doid.owl

wound botulism
type: Class
subclass of: botulism
IAO_0000115: A botulism that involves intoxication caused by botulinum neurotoxins (BoNTA, B, E and F), has_material_basis_in Clostridium botulinum A, has_material_basis_in Clostridium botulinum B, has_material_basis_in Clostridium botulinum E and has_material_basis_in Clostridium botulinum F, which are transmitted by contact of spores with the open wounds, which then reproduce in an anaerobic environment to produce toxins.
IAO_0000412: doid.owl

infant botulism
type: Class
subclass of: botulism
IAO_0000115: A botulism that involves intoxication caused by botulinum neurotoxins (BoNTA or B) in infants, has_material_basis_in Clostridium botulinum A or has_material_basis_in Clostridium botulinum B, which are transmitted_by ingestion of bacterial spores, which then grow in the intestine and release toxins. The infection has_symptom constipation, has_symptom lethargy, has_symptom difficulty feeding, has_symptom swallowing, has_symptom ptosis, has_symptom loss of head control, and has_symptom muscle weakness.
IAO_0000412: doid.owl

glandular tularemia
type: Class
subclass of: tularemia
IAO_0000115: A tularemia that results_in swelling of regional lymph glands.
IAO_0000412: doid.owl

typhoidal tularemia
type: Class
subclass of: tularemia
IAO_0000115: A tularemia that results_in bacteremia and has_symptom fever, has_symptom chills, has_symptom myalgia, has_symptom malaise, and has_symptom weight loss.
IAO_0000412: doid.owl

Carrion's disease
type: Class
subclass of: bartonellosis
IAO_0000115: A bartonellosis that results_in infection located_in endothelial cells or located_in red blood cells, has_material_basis_in Bartonella bacilliformis, which is transmitted_by sandflies of genus Lutzomyia. The infection has acute and chronic phases. The acute phase is characterized by severe hemolytic anemia and transient immunosuppression. The chronic phase is characterized by verruga peruana lesions which may ulcerate and bleed.
IAO_0000412: doid.owl

Buruli ulcer disease
type: Class
subclass of: primary bacterial infectious disease
IAO_0000115: A primary bacterial infectious disease that results_in infection located_in skin or located_in subcutaneous tissue, has_material_basis_in Mycobacterium ulcerans, which could be transmitted_by insects. The bacterium produces a toxin, named mycolactone, which causes subcutaneous fat necrosis and inhibits an immune response. The infection has_symptom nodule, which is a painless, mobile swelling in the skin.
IAO_0000412: doid.owl

epidemic typhus
type: Class
subclass of: typhus
IAO_0000115: A typhus that has_material_basis _in Rickettsia prowazekii, which is transmitted by human body louse (Pediculus humanus corporis). The infection has_symptom high fever, has_symptom cough, has_symptom rash, has_symptom severe muscle pain, has_symptom chills, has_symptom falling blood pressure, has_symptom stupor, has_symptom sensitivity to light, and has_symptom delirium.
IAO_0000412: doid.owl

endemic typhus
type: Class
subclass of: typhus
IAO_0000115: A typhus that has_material_basis_in Rickettsia typhi or has_material_basis_in Rickettsia felis, which are transmitted by fleas (Xenopsylla cheopis). The infection has symptom headache, has symptom fever, has symptom chills, has symptom myalgia, has symptom nausea, has symptom vomiting, has symptom cough and has symptom rash.
IAO_0000412: doid.owl

aneruptive fever
type: Class
subclass of: spotted fever
IAO_0000115: A spotted fever that has_material_basis_in Rickettsia helvetica, which is transmitted_by ticks (Ixodes sp). The infection has_symptom fever, has_symptom headache, has_symptom myalgia.
IAO_0000412: doid.owl

sennetsu fever
type: Class
subclass of: primary bacterial infectious disease
IAO_0000115: A primary bacterial infectious disease that results_in infection, has_material_basis_in Neorickettsia sennetsu, which is transmitted_by ingestion of raw or under-cooked gray mullet fish infected with the trematodes. The infection has_symptom fever, has_symptom malaise, has_symptom anorexia, has_symptom lymphadenopathy, has_symptom hepatosplenomegaly, has_symptom fatigue, has_symptom chills, has_symptom headache, has_symptom backache and has_symptom myalgia.
IAO_0000412: doid.owl

exanthem
type: Class
subclass of: skin disease
IAO_0000115: A skin disease that is characterized by a rash that results from a variety of causes including bacteria, viruses, toxins, drugs and autoimmune disorders.
IAO_0000412: doid.owl

bacterial exanthem
type: Class
subclass of: exanthem
subclass of: bacterial infectious disease
IAO_0000115: An exanthem that is characterized by a diffuse, reddened, blanchable, finely papular, sandpaper like rash due to infection by group A streptococcus and the production of an erythrogenic toxin.
IAO_0000412: doid.owl

early congenital syphilis
type: Class
subclass of: congenital syphilis
IAO_0000115: A congenital syphilis that is manifested during the first 3 months of life. The infection has_symptom skin lesions, has_symptom lymphadenopathy, has_symptom hepatosplenomegaly, has_symptom failure to thrive, has_symptom blood-stained nasal discharge, has_symptom perioral fissures, has_symptom meningitis, has_symptom choroiditis, has_symptom hydrocephalus, has_symptom seizures, has_symptom intellectual disability, has_symptom osteochondritis, and has_symptom pseudoparalysis.
IAO_0000412: doid.owl

parenchymatous neurosyphilis
type: Class
subclass of: tertiary neurosyphilis
IAO_0000115: A tertiary neurosyphilis that results when chronic meningoencephalitis causes destruction of cortical parenchyma. The infection has_symptom irritability, has_symptom difficulty concentrating, has_symptom deterioration of memory, has_symptom defective judgment, has_symptom headaches, has_symptom insomnia, has_symptom fatigue, and has_symptom lethargy.
IAO_0000412: doid.owl

meningovascular neurosyphilis
type: Class
subclass of: tertiary neurosyphilis
IAO_0000115: A tertiary neurosyphilis that results in inflammation located_in arteries of the brain or located_in arteries of spinal cord. The infection has_symptom headache, has_symptom neck stiffness, has_symptom dizziness, has_symptom behavioral abnormalities, has _symptom poor concentration, has_symptom memory loss, has _symptom lassitude, has_symptom insomnia, has_symptom blurred vision, has_symptom weakness and wasting of shoulder-girdle and arm muscles, has_symptom slowly progressive leg weakness with urinary or fecal incontinence or both, and has_symptom paralysis of the legs due to thrombosis of spinal arteries.
IAO_0000412: doid.owl

gummatous syphilis
type: Class
subclass of: tertiary syphilis
IAO_0000115: A tertiary syphilis that is characterized by granulomatous lesions, called gummas, which are characterized by a center of necrotic tissue with a rubbery texture. They form in the liver, bones, and testes but may affect any organ.
IAO_0000412: doid.owl

inflammatory bowel disease
type: Class
subclass of: intestinal disease
IAO_0000115: An intestinal disease characterized by inflammation located in all parts of digestive tract.
IAO_0000412: doid.owl

extrapulmonary tuberculosis
type: Class
subclass of: tuberculosis
IAO_0000115: A tuberculosis that occurs at body sites other than the lung.
IAO_0000412: doid.owl

abdominal tuberculosis
type: Class
subclass of: extrapulmonary tuberculosis
IAO_0000115: An extrapulmonary tuberculosis that is located_in gastrointestinal tract, located_in peritoneum, located_in omentum, located_in mesentery, located_in liver, located_in spleen or located_in pancreas.
IAO_0000412: doid.owl

organ system cancer
type: Class
subclass of: cancer
IAO_0000115: A cancer that is classified based on the organ it starts in.
IAO_0000412: doid.owl

cardiomyopathy
type: Class
subclass of: heart disease
IAO_0000115: A heart disease and a myopathy that is characterized by deterioration of the function of the heart muscle.
IAO_0000412: doid.owl

pericardium disease
type: Class
subclass of: cardiovascular system disease
IAO_0000115: A cardiovascular system disease that is located_in the fibrous sac surrounding the heart.
IAO_0000412: doid.owl

autoimmune disease of gastrointestinal tract
type: Class
subclass of: autoimmune disease
subclass of: gastrointestinal system disease
IAO_0000115: An autoimmune disease that is the abnormal functioning of the immune system that causes your immune system to produce antibodies or T cells against cells and/or tissues in the gastrointestinal tract.
IAO_0000412: doid.owl

gluten allergy
type: Class
subclass of: food allergy
IAO_0000115: A food allergy that develops from an immune reaction to eating gluten, a protein found in wheat, barley, rye and triticale and that is characterized by stomach cramping, diarrhea and gastrointestinal upset and is unrelated to the gluten intolerance.
IAO_0000412: doid.owl

thoracic disease
type: Class
subclass of: disease of anatomical entity
IAO_0000115: A disease of anatomical entity that is located_in the thoracic cavity.
IAO_0000412: doid.owl

colitis
type: Class
subclass of: inflammatory bowel disease
IAO_0000115: An inflammatory bowel disease that involves inflammation located_in colon.
IAO_0000412: doid.owl

bacillary angiomatosis
type: Class
subclass of: bartonellosis
IAO_0000115: A bartonellosis that has_material_basis_in Bartonella henselae or has_material_basis_in Bartonella quintana. The disease is characterized by the proliferation of blood vessels, resulting in them forming tumour-like masses in the skin and other organs.
IAO_0000412: doid.owl

chicken egg allergy
type: Class
subclass of: egg allergy
IAO_0000115: An egg allergy triggered by Gallus gallus eggs.
IAO_0000412: doid.owl

shellfish allergy
type: Class
subclass of: food allergy
IAO_0000115: A food allergy triggered by Crustacea or Mollusca.
IAO_0000412: doid.owl

gastrointestinal allergy
type: Class
subclass of: allergic disease
IAO_0000115: An allergic disease that is located_in the gastrointestinal tract.
IAO_0000412: doid.owl

fruit allergy
type: Class
subclass of: food allergy
IAO_0000115: A food allergy triggered by a plant fruit product.
IAO_0000412: doid.owl

apple allergy
type: Class
subclass of: fruit allergy
IAO_0000115: A fruit allergy triggered by Malus domestica plant fruit food product.
IAO_0000412: doid.owl

apricot allergy
type: Class
subclass of: fruit allergy
IAO_0000115: A fruit allergy triggered by Prunus armeniaca plant fruit food product.
IAO_0000412: doid.owl

cherry allergy
type: Class
subclass of: fruit allergy
IAO_0000115: A fruit allergy triggered by Prunus avium plant fruit food product.
IAO_0000412: doid.owl

Indian plum allergy
type: Class
subclass of: fruit allergy
IAO_0000115: A fruit allergy triggered by Ziziphus mauritiana plant fruit food product.
IAO_0000412: doid.owl

orange allergy
type: Class
subclass of: fruit allergy
IAO_0000115: A fruit allergy triggered by Citrus sinensis plant fruit food product.
IAO_0000412: doid.owl

melon allergy
type: Class
subclass of: fruit allergy
IAO_0000115: A fruit allergy triggered by Cucumis melo plant fruit food product.
IAO_0000412: doid.owl

peach allergy
type: Class
subclass of: fruit allergy
IAO_0000115: A fruit allergy triggered by Prunus persica plant fruit food product.
IAO_0000412: doid.owl

plum allergy
type: Class
subclass of: fruit allergy
IAO_0000115: A fruit allergy triggered by Prunus domestica plant fruit food product.
IAO_0000412: doid.owl

tomato allergy
type: Class
subclass of: fruit allergy
IAO_0000115: A fruit allergy triggered by Solanum lycopersicum plant fruit food product.
IAO_0000412: doid.owl

fish allergy
type: Class
subclass of: food allergy
IAO_0000115: A food allergy triggered by fish.
IAO_0000412: doid.owl

Atlantic cod allergy
type: Class
subclass of: fish allergy
IAO_0000115: A fish allergy triggered by Gadus morhua.
IAO_0000412: doid.owl

Atlantic salmon allergy
type: Class
subclass of: fish allergy
IAO_0000115: A fish allergy triggered by Salmo salar.
IAO_0000412: doid.owl

carp allergy
type: Class
subclass of: fish allergy
IAO_0000115: A fish allergy triggered by Cyprinus carpio.
IAO_0000412: doid.owl

zebrafish allergy
type: Class
subclass of: fish allergy
IAO_0000115: A fish allergy triggered by Danio rerio.
IAO_0000412: doid.owl

rainbow trout allergy
type: Class
subclass of: fish allergy
IAO_0000115: A fish allergy triggered by Oncorhynchus mykiss.
IAO_0000412: doid.owl

cow milk allergy
type: Class
subclass of: milk allergy
IAO_0000115: A milk allergy triggered by Bos taurus milk.
IAO_0000412: doid.owl

goat milk allergy
type: Class
subclass of: milk allergy
IAO_0000115: A milk allergy triggered by Capra hircus milk.
IAO_0000412: doid.owl

mollusc allergy
type: Class
subclass of: shellfish allergy
IAO_0000115: A shellfish allergy triggered by Mollusca.
IAO_0000412: doid.owl

crustacean allergy
type: Class
subclass of: shellfish allergy
IAO_0000115: A shellfish allergy triggered by Crustacea.
IAO_0000412: doid.owl

brown shrimp allergy
type: Class
subclass of: shrimp allergy
IAO_0000115: A crustacean allergy triggered by Farfantepenaeus aztecus.
IAO_0000412: doid.owl

crab allergy
type: Class
subclass of: crustacean allergy
IAO_0000115: A crustacean allergy triggered by Scylla paramamosain.
IAO_0000412: doid.owl

Indian prawn allergy
type: Class
subclass of: shrimp allergy
IAO_0000115: A crustacean allergy triggered by Fenneropenaeus indicus.
IAO_0000412: doid.owl

tiger prawn allergy
type: Class
subclass of: shrimp allergy
IAO_0000115: A crustacean allergy triggered by Penaeus monodon.
IAO_0000412: doid.owl

white shrimp allergy
type: Class
subclass of: shrimp allergy
IAO_0000115: A crustacean allergy triggered by Litopenaeus vannamei.
IAO_0000412: doid.owl

snail allergy
type: Class
subclass of: mollusc allergy
IAO_0000115: A mollusc allergy triggered by snails.
IAO_0000412: doid.owl

horned turban snail allergy
type: Class
subclass of: snail allergy
IAO_0000115: A snail allergy triggered by the horned turban snail.
IAO_0000412: doid.owl

cardiac tuberculosis
type: Class
subclass of: heart disease
subclass of: tuberculosis
IAO_0000115: A tuberculosis located in the heart.
IAO_0000412: doid.owl

salmonellosis
type: Class
subclass of: primary bacterial infectious disease
IAO_0000115: A primary bacterial infectious disease caused by the bacteria of the genus Salmonella. It has sypmtoms diarrhea, fever, vomiting, and abdominal cramps 12 to 72 hours after infection. In most cases, the illness lasts four to seven days, and most people recover without treatment.
IAO_0000412: doid.owl

legume allergy
type: Class
subclass of: fruit allergy
IAO_0000115: A fruit allergy triggered by Fabaceae (legume) plant fruit or seed food product.
IAO_0000412: doid.owl

vegetable allergy
type: Class
subclass of: food allergy
IAO_0000115: A food allergy triggered by a vegetable food product.
IAO_0000412: doid.owl

celery allergy
type: Class
subclass of: vegetable allergy
IAO_0000115: A vegetable allergy triggered by celery (Apium graveolens).
IAO_0000412: doid.owl

ocular tuberculosis
type: Class
subclass of: tuberculosis
subclass of: eye disease
IAO_0000115: A tuberculosis that is located_in some eye, has_material_basis_in Mycobacterium tuberculosis, and has_sypmtom inflamed eyes.
IAO_0000412: doid.owl

muscular disease
type: Class
subclass of: musculoskeletal system disease
IAO_0000115: A musculoskeletal system disease that affects the muscles.
IAO_0000412: doid.owl

bone disease
type: Class
subclass of: connective tissue disease
IAO_0000115: A connective tissue disease that affects the structure or development of bone or causes an impairment of normal bone function.
IAO_0000412: doid.owl

physical disorder
type: Class
subclass of: disease
IAO_0000115: A disease that has_material_basis_in a genetic abnormality, error with embryonic development, infection or compromised intrauterine environment.
IAO_0000412: doid.owl

meningococcal meningitis
type: Class
subclass of: bacterial meningitis
IAO_0000115: A bacterial meningitis that has_material_basis_in Neisseria meningitidis infection.
IAO_0000412: doid.owl

haemophilus meningitis
type: Class
subclass of: bacterial meningitis
IAO_0000115: A bacterial meningitis that has_material_basis_in Haemophilus influenzae infection.
IAO_0000412: doid.owl

epididymis disease
type: Class
subclass of: male reproductive system disease
IAO_0000115: A male reproductive system disease that is located_in the epididymis.
IAO_0000412: doid.owl

Coronavirus infectious disease
type: Class
subclass of: viral infectious disease
IAO_0000115: A viral infectious disease that has_material_basis_in Coronavirus.
IAO_0000412: doid.owl

urinary tract infection
type: Class
subclass of: bacterial infectious disease
subclass of: urinary system disease
IAO_0000115: An urinary system disease that is characterized by an infection in any part of the urinary system, including the kidneys, ureters, bladder or urethra.
IAO_0000412: doid.owl

tuberculous encephalopathy
type: Class
subclass of: tuberculosis
IAO_0000115: A tuberculosis that is characterized by cerebral edema sometimes with features similar to acute disseminated encephalomyelitis (ADEM) and may manifest with a variety of symptoms ranging from focal neurological deficits to convulsions and decreased conscious state.
IAO_0000412: doid.owl

parsley allergy
type: Class
subclass of: vegetable allergy
IAO_0000115: A vegetable allergy triggered by parsley (Petroselinum).
IAO_0000412: doid.owl

dill allergy
type: Class
subclass of: vegetable allergy
IAO_0000115: A food allergy triggered by dill (Anethum graveolens).
IAO_0000412: doid.owl

tabes dorsalis
type: Class
subclass of: tertiary neurosyphilis
IAO_0000115: A tertiary neurosyphilis that results in slow degeneration of the nerve cells and nerve fibers that carry sensory information to the brain. The infection has symptom intense, stabbing pain in the back and legs that recurs irregularly, has symptom gait ataxia, has symptom hyperesthesia, has symptom paresthesia, has symptom loss of bladder sensation leading to urine retention, has symptom erectile dysfunction.
IAO_0000412: doid.owl

asymptomatic neurosyphilis
type: Class
subclass of: tertiary neurosyphilis
IAO_0000115: A tertiary neurosyphilis that results_in mild meningitis.
IAO_0000412: doid.owl

late congenital syphilis
type: Class
subclass of: congenital syphilis
IAO_0000115: A congenital syphilis that occurs in children at or greater than two years of age who acquired the infection trans-placentally. The infection has_symptom gummatous ulcers, has_symptom periosteal lesions, has_symptom paresis, has_symptom tabes, has_symptom optic atrophy, has_symptom interstitial keratitis, has_symptom sensorineural deafness, and has_symptom dental deformities.
IAO_0000412: doid.owl

syphilitic meningitis
type: Class
subclass of: bacterial meningitis
IAO_0000115: A bacterial meningitis that is characterized by inflammation of the tissues covering the brain and spinal cord.
IAO_0000412: doid.owl

pinta disease
type: Class
subclass of: primary bacterial infectious disease
IAO_0000115: A primary bacterial infectious disease that results_in infection located_in skin, has_material_basis_in Treponema carateum, which is transmitted_by contact with skin and mucous membrane of an infected person. The infection has_symptom pruritic plaque, which slowly enlarges and becomes pigmented and hyperkeratotic.
IAO_0000412: doid.owl

borderline leprosy
type: Class
subclass of: leprosy
IAO_0000115: A leprosy that results in small numerous red irregularly shaped plaques.
IAO_0000412: doid.owl

leprosy
type: Class
subclass of: primary bacterial infectious disease
IAO_0000115: A primary bacterial infectious disease that results_in infection located_in superficial peripheral nerves, located_in skin, located_in mucous membranes of the upper respiratory tract, located_in anterior chamber of the eyes, or located_in testes, has_material_basis_in Mycobacterium leprae, which is transmitted_by aerosol spread from infected nasal secretions to exposed nasal and oral mucosa. The infection has_symptom skin lesions, has_symptom sensory loss, has_symptom motor loss and has_symptom eye damage.
IAO_0000412: doid.owl

ehrlichiosis
type: Class
subclass of: primary bacterial infectious disease
IAO_0000115: A primary bacterial infectious disease that results in infection located_in leukocyte, has_material_basis_in Ehrlichia chaffeensis or Anaplasma phagocytophilum, which are transmitted_by lone star tick and transmitted_by black-legged tick respectively. The infection has_symptom headache, has_symptom muscle aches, has_symptom fatigue and has_symptom rash.
IAO_0000412: doid.owl

tuberculoid leprosy
type: Class
subclass of: leprosy
IAO_0000115: A leprosy that results in one erythematous large plaque with well-defined borders that are elevated and that slope down into an atrophic center.
IAO_0000412: doid.owl

yaws
type: Class
subclass of: primary bacterial infectious disease
IAO_0000115: A primary bacterial infectious disease that results in infection located in skin, located in joint or located in bone, has_material_basis_in Treponema pallidum subsp pertenue, which is transmitted by direct skin contact with an infected person. The infection has symptom skin lesions.
IAO_0000412: doid.owl

pneumonic plague
type: Class
subclass of: plague
subclass of: lung disease
IAO_0000115: A plague that results_in infection located_in lung, which results from direct inhalation of the bacillus and has_symptom fever, has_symptom chills, has_symptom cough and has_symptom difficulty breathing.
IAO_0000412: doid.owl

seminal vesicle chronic gonorrhea
type: Class
subclass of: gonococcal seminal vesiculitis
IAO_0000412: doid.owl

bacterial infectious disease
type: Class
subclass of: disease by infectious agent
IAO_0000115: A disease by infectious agent that results_in infection, has_material_basis_in Bacteria.
IAO_0000412: doid.owl

gonococcal seminal vesiculitis
type: Class
subclass of: gonorrhea
subclass of: vesiculitis
IAO_0000412: doid.owl

Legionnaires' disease
type: Class
subclass of: legionellosis
IAO_0000115: A legionellosis that is characterized by severe form of infection producing pneumonia. Symptoms include fever, chills, and cough.
IAO_0000412: doid.owl

legionellosis
type: Class
subclass of: primary bacterial infectious disease
IAO_0000115: A primary bacterial infectious disease that results_in infection located_in respiratory tract, has_material_basis_in Legionella pneumophila, which is transmitted_by inhalation of droplets containing bacteria. The symptoms include dry cough, fever, headache and diarrhea.
IAO_0000412: doid.owl

late yaws
type: Class
subclass of: yaws
IAO_0000115: A yaws that appears after five years of the initial infection and is characterized by disabling consequences of the nose, bones and palmar/plantar hyperkeratosis.
IAO_0000412: doid.owl

early yaws
type: Class
subclass of: yaws
IAO_0000115: A yaws that results in initial papule at the site of entry of bacteria. Without treatment, this is followed by disseminated skin lesions over the body. Bone pain and bone lesions may also occur.
IAO_0000412: doid.owl

pleural tuberculosis
type: Class
subclass of: extrapulmonary tuberculosis
subclass of: allergic disease
subclass of: pleural disease
IAO_0000115: An extrapulmonary tuberculosis that results_in lymphocyte-predominant exudative pleural effusion, located_in pleura. This results from an allergic response to tuberculoprotein causing the permeabiltity of the pleural vasculature to alter leading to a sub-pleural caseous focus rupture into the pleural sac.
IAO_0000412: doid.owl

mastitis
type: Class
subclass of: breast disease
IAO_0000115: A breast disease characterized by painful infection of the breast tissue.
IAO_0000412: doid.owl

bubonic plague
type: Class
subclass of: plague
subclass of: lymph node disease
IAO_0000115: A plague that results_in infection located_in lymph node producing a bubo, which is an inflamed, necrotic, and hemorrhagic lymphoid tissue. The infection has_symptom enlarged, tender lymph nodes, has_symptom fever, has_symptom chills and has_symptom prostration.
IAO_0000412: doid.owl

Queensland tick typhus
type: Class
subclass of: spotted fever
IAO_0000115: A spotted fever that has_material_basis_in Rickettsia australis, which is transmitted_by ticks (Ixodes holocyclus). The infection has_symptom fever, has_symptom headache, has_symptom myalgia, has_symptom maculopapular rash, and has_symptom lymphadenopathy.
IAO_0000412: doid.owl

lepromatous leprosy
type: Class
subclass of: leprosy
IAO_0000115: A leprosy that results in early cutaneous lesions which consist of pale macules that are small, diffuse, and symmetric. This form of leprosy is characterized by hypoesthesia over extensor surfaces of the distal extremities, alopecia affecting lateral aspects of the eyebrows, saddle-nose deformity and oral lepromas.
IAO_0000412: doid.owl

Siberian tick typhus
type: Class
subclass of: spotted fever
IAO_0000115: A spotted fever that has_material_basis_in Rickettsia sibirica, which is transmitted_by ticks (Dermacentor nuttalli, Dermacentor marginatus and Haemaphysalis concinna). The infection has_symptom fever, has_symptom eschar, has_symptom regional adenopathy, and has_symptom maculopapular rash.
IAO_0000412: doid.owl

ovarian disease
type: Class
subclass of: gonadal disease
subclass of: female reproductive system disease
IAO_0000115: A female reproductive system disease that is located_in the ovary.
IAO_0000412: doid.owl

pasteurellosis
type: Class
subclass of: primary bacterial infectious disease
IAO_0000115: A primary bacterial infectious disease that results_in systemic infection, has_material_basis_in Pasteurella multocida, which is transmitted_by animal bite, scratch, or lick. The infection has_symptom joint pain has_symptom fever, has_symptom rigors, has_symptom pneumonia, has_symptom meningeal irritation, and has_symptom tachycardia.
IAO_0000412: doid.owl

Brucella suis brucellosis
type: Class
subclass of: brucellosis
IAO_0000115: A brucellosis that involves an infection caused by Brucella suis [NCBITaxon:29461] in swine and humans. The disease has_symptom fever, has_symptom chills, has_symptom malaise, has_symptom diaphoresis, has_symptom arthralgia, has_symptom myalgia, has_symptom headache, has_symptom anorexia, and has_symptom fatigue.
IAO_0000412: doid.owl

brucellosis
type: Class
subclass of: primary bacterial infectious disease
IAO_0000115: A primary bacterial infectious disease that is caused by the bacteria of the genus Brucella, when humans come in contact with contaminated animals or animal products or ingestion of infected food products. The disease has_symptom fever, has_symptom sweat, has_symptom headache, has_symptom back pain, has_symptom physical weakness, has_symptom joint pain and has_symptom fatigue.
IAO_0000412: doid.owl

Q fever
type: Class
subclass of: primary bacterial infectious disease
IAO_0000115: A primary bacterial infectious disease that is a zoonotic infectious disease affecting multiple organs, has_material_basis_in Coxiella burnetii, which is transmitted_by inhalation of air contaminated by barnyard dust containing dried placental material, birth fluids, or excreta of infected herd animals, transmitted_by ingestion of contaminated milk, transmitted_by tick bites and transmitted_by contact with infected person. The infection has_symptom fever, has_symptom headache, has_symptom cough, has_symptom pleuritic chest pain, has_symptom myalgia and has_symptom arthralgia.
IAO_0000412: doid.owl

trench fever
type: Class
subclass of: bartonellosis
IAO_0000115: A primary bacterial infectious disease that results in systemic infection, has_material_basis_in Bartonella quintana, which is transmitted by body lice (Pediculus humanus corporis). The infection has symptom relapsing fever, has symptom headache, has symptom shin pain, and has symptom soreness of the muscles of the legs and back.
IAO_0000412: doid.owl

bartonellosis
type: Class
subclass of: primary bacterial infectious disease
IAO_0000115: A primary bacterial infectious disease that is caused by the bacteria of the genus Bartonella.
IAO_0000412: doid.owl

rickettsialpox
type: Class
subclass of: spotted fever
IAO_0000115: A spotted fever that has_material_basis_in Rickettsia akari, which is transmitted_by house mouse mite (Liponyssoides sanguineus) found on mice and other rodents. The infection has_symptom fever, has_symptom chills, has_symptom headache, has_symptom myalgia, and has_symptom papulovesicular rash.
IAO_0000412: doid.owl

spotted fever
type: Class
subclass of: primary bacterial infectious disease
IAO_0000115: A primary bacterial infectious disease that results in infection, located in endothelial cell of artery or located in endothelial cell of vein, has_material_basis_in Rickettsia, which is transmitted by ticks and mites. The infection has symptom fever, has symptom headache, has symptom fatigue, has symptom muscle aches, and has symptom maculopapular or petechial rash. A distinctive eschar (blackened or crusted skin) may develop at the site of a tick bite.
IAO_0000412: doid.owl

pertussis
type: Class
subclass of: commensal bacterial infectious disease
IAO_0000115: A commensal bacterial infectious disease that results_in inflammation located_in respiratory tract, has_material_basis_in Bordetella pertussis, or has_material_basis_in Bordetella parapertussis, which produce toxins that paralyze the cilia of the respiratory epithelial cells. The infection is characterized by a prolonged, high-pitched, deeply indrawn breath (whoop).
IAO_0000412: doid.owl

respiratory failure
type: Class
subclass of: lung disease
IAO_0000115: A lung disease characterized by inadequate gas exchange by the respiratory system.
IAO_0000412: doid.owl

disseminated intravascular coagulation
type: Class
subclass of: thrombophilia
IAO_0000412: doid.owl

Brill-Zinsser disease
type: Class
subclass of: epidemic typhus
IAO_0000115: An epidemic typhus that is a mild form of the disease, which recurs in someone after a long period of latency due to immunosuppression, malnutrition or other illnesses.
IAO_0000412: doid.owl

typhus
type: Class
subclass of: primary bacterial infectious disease
IAO_0000115: A primary bacterial infectious disease that refers to a group of diseases, located in endothelial cells of the small venous, arterial, and capillary vessels, has_material_basis_in Rickettsia bacteria, which are transmitted by lice, transmitted by fleas, and transmitted by mites.
IAO_0000412: doid.owl

cat-scratch disease
type: Class
subclass of: bartonellosis
subclass of: lymph node disease
IAO_0000115: A bartonellosis that results_in infection located_in lymph node, has_material_basis_in Bartonella henselae or has_material_basis_in Bartonella clarridgeiae, which are transmitted_by scratch or bite of a kitten, or transmitted_by contact of animal's saliva with an eye or through broken skin. The infection has_symptom regional lymphadenopathy, has_symptom headache, has_symptom chills, has_symptom backache, and has_symptom abdominal pain.
IAO_0000412: doid.owl

ornithosis
type: Class
subclass of: primary bacterial infectious disease
IAO_0000115: A primary bacterial infectious disease that results_in systemic infection, has_material_basis_in Chlamydia psittaci, which is transmitted_by inhaling aerosolized dried droppings or transmitted_by contact with infected birds. The infection has_symptom fever, has_symptom headache, has_symptom rash, has_symptom chills, and has_symptom pneumonia.
IAO_0000412: doid.owl

chlamydia
type: Class
subclass of: commensal bacterial infectious disease
IAO_0000115: A commensal bacterial infectious disease that is caused by Chlamydia trachomatis.
IAO_0000412: doid.owl

trachoma
type: Class
subclass of: commensal bacterial infectious disease
subclass of: eye disease
IAO_0000115: A commensal bacterial infectious disease that results_in infection located_in eye, has_material_basis_in Chlamydia trachomatis (A, B, Ba and C serovars), which is transmitted_by contact with eye discharge from the infected person and transmitted_by congenital method. The infection causes eyelid to turn inward which makes eyelashes to scratch the cornea.
IAO_0000412: doid.owl

rhinoscleroma
type: Class
subclass of: primary bacterial infectious disease
IAO_0000115: A primary bacterial infectious disease that involves the inflammation of mucosa lining the nasal cavity, pharynx, larynx, trachea and bronchi that is characterized by the formation of granulomas, dense induration of the tissues and nodular deformity caused by Klebsiella rhinoscleromatis.
IAO_0000412: doid.owl

Lemierre's syndrome
type: Class
subclass of: commensal bacterial infectious disease
IAO_0000115: A commensal bacterial infectious disease that is characterized by systemic sepsis, ulcerative or necrotic lesions and multisystem abscesses caused by Fusobacterium necrophorum. The disease often first presents as a severe tonsillitis or pharyngitis with high-grade fever and chills together with leukocytosis, cervical pain and neck swelling.
IAO_0000412: doid.owl

tetanus
type: Class
subclass of: primary bacterial infectious disease
IAO_0000115: A primary bacterial infectious disease that results in prolonged contraction of skeletal muscle fibers, has_material_basis_in Clostridium tetani, which produces tetanospasmin, a neurotoxin, which is carried to the brain and spinal cord, where it binds irreversibly to receptors inhibiting neurotransmission. Damaged upper motor neurons cannot control reflex responses to afferent sensory stimuli.
IAO_0000412: doid.owl

adult respiratory distress syndrome
type: Class
subclass of: respiratory failure
IAO_0000115: A respiratory failure that results from diffuse injury to the endothelium of the lung (as in sepsis, chest trauma, massive blood transfusion, aspiration of the gastric contents, or pneumonia) and is characterized by pulmonary edema with an abnormally high amount of protein in the edematous fluid and by difficult rapid breathing and hypoxemia.
IAO_0000412: doid.owl

heart disease
type: Class
subclass of: cardiovascular system disease
IAO_0000115: A cardiovascular system disease that involves the heart.
IAO_0000412: doid.owl

diphtheria
type: Class
subclass of: primary bacterial infectious disease
IAO_0000115: A primary bacterial infectious disease that is characterized by sore throat, low fever, and an adherent membrane (a pseudomembrane) on the tonsils, pharynx, and/or nasal cavity. A milder form of diphtheria can be restricted to the skin. It is caused by Corynebacterium diphtheriae, an aerobic Gram-positive bacterium. Diphtheria toxin spreads through the bloodstream and can lead to potentially life-threatening complications that affect other organs of the body, such as the heart and kidneys.
IAO_0000412: doid.owl

Listeria meningitis
type: Class
subclass of: bacterial meningitis
IAO_0000115: A bacterial meningitis that has_material_basis_in Listeria monocytogenes infection.
IAO_0000412: doid.owl

listeriosis
type: Class
subclass of: primary bacterial infectious disease
IAO_0000115: A primary bacterial infectious disease that results_in infection, has_material_basis_in Listeria monocytogenes, which is transmitted_by ingestion of contaminated food or raw milk or transmitted_by congenital method. Ingestion of Listeria by pregnant women has_symptom nausea, has_symptom vomiting, has_symptom diarrhea, has_symptom fever, has_symptom malaise, has_symptom back pain, and has_symptom headache. Maternal infection with Listeria can result in chorioamnionitis, premature labor, spontaneous abortion, or stillbirth.
IAO_0000412: doid.owl

streptococcal meningitis
type: Class
subclass of: bacterial meningitis
IAO_0000115: A bacterial meningitis that has_material_basis_in streptococcal bacteria.
IAO_0000412: doid.owl

Lyme disease
type: Class
subclass of: primary bacterial infectious disease
IAO_0000115: A primary bacterial infectious disease that results_in infection, has_material_basis_in Borrelia burgdorferi, which is transmitted_by blacklegged tick (Ixodes scapularis) or transmitted_by western blacklegged tick (Ixodes pacificus). The infection has_symptom fever, has_symptom headache, has_symptom fatigue, and has_symptom skin rash called erythema migrans. If left untreated, infection can spread to joints, the heart, and the nervous system.
IAO_0000412: doid.owl

Bordetella parapertussis whooping cough
type: Class
subclass of: pertussis
IAO_0000115: A pertussis that is a milder disease caused by the bacterium Bordetella parapertussis. The disease has_symptom coughing, has_symptom sneezing, or has_symptom runny nose .
IAO_0000412: doid.owl

indeterminate leprosy
type: Class
subclass of: leprosy
IAO_0000115: A leprosy that is an early form of the disease which causes one to a few hypopigmented or erythematous macules.
IAO_0000412: doid.owl

esophagitis
type: Class
subclass of: esophageal disease
IAO_0000412: doid.owl

botulism
type: Class
subclass of: primary bacterial infectious disease
IAO_0000115: A primary bacterial infectious disease that involves intoxication caused by botulinum neurotoxins (BoNTA, B, E and F) located in neuromuscular junction resulting in descending muscle paralysis, has_material_basis_in Clostridium botulinum A, has_material_basis_in Clostridium botulinum B, has_material_basis_in Clostridium botulinum E and has_material_basis_in Clostridium botulinum F.
IAO_0000412: doid.owl

ulceroglandular tularemia
type: Class
subclass of: tularemia
IAO_0000115: A tularemia that results_in painful regional lymphadenopathy and an ulcerated skin lesion.
IAO_0000412: doid.owl

allergic disease
type: Class
subclass of: immune system disease
IAO_0000115: An immune system disease that is an exaggerated immune response to allergens, such as insect venom, dust mites, pollen, pet dander, drugs or some foods.
IAO_0000412: doid.owl

sodoku disease
type: Class
subclass of: primary bacterial infectious disease
IAO_0000115: A primary bacterial infectious disease that results_in infection, has_material_basis_in Spirillum minus, which is transmitted_by contact with urine or secretions from the mouth, eye, or nose of an infected animal or transmitted_by bite of an infected animal, especially rat. The infection has_symptom chills, has_symptom relapsing fever, has_symptom rash and has_symptom joint pain.
IAO_0000412: doid.owl

vaginal disease
type: Class
subclass of: female reproductive system disease
IAO_0000115: A female reproductive system disease that is located_in the vagina.
IAO_0000412: doid.owl

shigellosis
type: Class
subclass of: primary bacterial infectious disease
subclass of: colonic disease
IAO_0000115: A primary bacterial infectious disease that results_in infection located_in epithelium of colon, has_material_basis_in Shigella boydii, has_material_basis_in Shigella dysenteriae, has_material_basis_in Shigella flexneri, or has_material_basis_in Shigella sonnei, which produce toxins that can attack the lining of the large intestine, causing swelling, ulcers on the intestinal wall, and bloody diarrhea. The bacteria are transmitted_by ingestion of food and water contaminated with feces.
IAO_0000412: doid.owl

blood coagulation disease
type: Class
subclass of: hematopoietic system disease
IAO_0000115: A hematopoietic system disease that is characterized by abnormal blood clotting or bleeding.
IAO_0000412: doid.owl

tuberculous epididymitis
type: Class
subclass of: epididymis disease
subclass of: urogenital tuberculosis
IAO_0000115: An urogenital tuberculosis that is located_in epididymis, has_symptom pain and has_symptom scrotal swelling.
IAO_0000412: doid.owl

hemolytic-uremic syndrome
type: Class
subclass of: kidney disease
IAO_0000115: A kidney disease that is characterized by hemolytic anemia, thrombocytopenia, and renal failure caused by platelet thrombi in the microcirculation of the kidney and other organs.
IAO_0000412: doid.owl

newborn respiratory distress syndrome
type: Class
subclass of: respiratory failure
IAO_0000115: A respiratory failure that is characterized by deficiency of the surfactant coating the inner surface of the lungs, by failure of the lungs to expand and contract properly during breathing with resulting collapse, and by the accumulation of a protein-containing film lining the alveoli and their ducts.
IAO_0000412: doid.owl

cardiovascular system disease
type: Class
subclass of: disease of anatomical entity
IAO_0000115: A disease of anatomical entity which occurs in the blood, heart, blood vessels or the lymphatic system that passes nutrients (such as amino acids and electrolytes), gases, hormones, blood cells or lymph to and from cells in the body to help fight diseases and help stabilize body temperature and pH to maintain homeostasis.
IAO_0000412: doid.owl

relapsing fever
type: Class
subclass of: primary bacterial infectious disease
IAO_0000115: A primary bacterial infectious disease that results_in infection, has_material_basis_in Borrelia, which is transmitted_by tick or transmitted_by body louse.
IAO_0000412: doid.owl

louse-borne relapsing fever
type: Class
subclass of: relapsing fever
IAO_0000115: A relapsing fever that is characterized by relapsing or recurring episodes of fever, has_material basis_in Borrelia recurrentis, which is transmitted_by body louse (Pediculus humanus). The infection has_symptom tachypnea, has_symptom tachycardia, has_symptom hepatosplenomegaly and has_symptom lymphadenopathy.
IAO_0000412: doid.owl

tick-borne relapsing fever
type: Class
subclass of: relapsing fever
IAO_0000115: A relapsing fever that is characterized by relapsing or recurring episodes of fever, has_material basis_in Borrelia hermsii, has_material basis_in Borrelia parkeri or has_material basis_in Borrelia duttoni, which are transmitted_by soft ticks (Ornithodoros parkeri and Ornithodoros hermsii). The infection has_symptom tachypnea, has_symptom tachycardia, has_symptom hepatosplenomegaly and has_symptom lymphadenopathy.
IAO_0000412: doid.owl

acute cystitis
type: Class
subclass of: cystitis
IAO_0000115: A cystitis characterized by a sudden onset or severe symptoms.
IAO_0000412: doid.owl

oculoglandular tularemia
type: Class
subclass of: tularemia
IAO_0000115: A tularemia that results_in inflammation of eye and swelling of lymph glands in front of the ear.
IAO_0000412: doid.owl

Haverhill fever
type: Class
subclass of: primary bacterial infectious disease
IAO_0000115: A primary bacterial infectious disease that results_in infection, has_material_basis_in Streptobacillus moniliformis, which is transmitted_by contact with urine or secretions from the mouth, eye, or nose of an infected animal or transmitted_by bite of an infected animal, especially rat. The infection has_symptom chills, has_symptom fever, has_symptom rash and has_symptom joint pain.
IAO_0000412: doid.owl

typhoid fever
type: Class
subclass of: primary bacterial infectious disease
IAO_0000115: A primary bacterial infectious disease that is a communicable systemic illness, has_material_basis_in Salmonella enterica subsp enterica serovar Typhi, which is transmitted_by ingestion of food or water contaminated with the feces of an infected person. The infection has_symptom fever, has_symptom diarrhea, has_symptom prostration, has_symptom headache, has_symptom splenomegaly, has_symptom liver enlargement, has_symptom eruption of rose-colored spots, and has_symptom leukopenia.
IAO_0000412: doid.owl

Klebsiella pneumonia
type: Class
subclass of: bacterial pneumonia
IAO_0000115: A bacterial pneumonia involving Klebsiella pneumoniae infection. Patients with Klebsiella pneumonia tend to cough up a characteristic sputum that is said to resemble red-currant jelly. Klebsiella pneumonia tends to affect people with underlying diseases, such as alcoholism, diabetes and chronic lung disease. The symptoms include high fever, rigors and pleuritic pain, and hemoptysis.
IAO_0000412: doid.owl

Mycoplasma pneumoniae pneumonia
type: Class
subclass of: bacterial pneumonia
IAO_0000115: A bacterial pneumonia that is caused by the bacterial species Mycoplasma pneumoniae. The symptoms include chest pain, chills, dry cough which is not bloody, excessive sweating, fever, headache and sore throat.
IAO_0000412: doid.owl

intestinal tuberculosis
type: Class
subclass of: gastrointestinal tuberculosis
subclass of: intestinal disease
IAO_0000115: A gastrointestinal tuberculosis that involves diffuse mucosal fold thickening, formation of ulcers and fistulae located_in intestine. The infection has_symptom abdominal pain, has_symptom gastrointestinal bleeding, has_symptom nausea and has_symptom vomiting.
IAO_0000412: doid.owl

scrub typhus
type: Class
subclass of: typhus
IAO_0000115: A typhus that has_material_basis_in Orientia tsutsugamushi, which is transmitted by trombiculid mites (Leptotrombidium deliense). The infection has symptom fever, has symptom headache, has symptom muscle pain, has symptom cough, has symptom maculopapular rash, has symptom eschar, has symptom splenomegaly and has symptom lymphadenopathy.
IAO_0000412: doid.owl

gastrointestinal anthrax
type: Class
subclass of: anthrax disease
subclass of: gastrointestinal system disease
IAO_0000115: An anthrax disease that results in infection located in mucosa of gastrointestinal tract, has_material_basis_in Bacillus anthracis, which is transmitted by ingestion of anthrax-infected meat. The infection has symptom lesions, has symptom vomiting of blood, has symptom severe diarrhea, has symptom loss of appetite.
IAO_0000412: doid.owl

bejel
type: Class
subclass of: primary bacterial infectious disease
IAO_0000115: A primary bacterial infectious disease that results in infection located in mucosa of mouth, located in skin or located in bone, has_material_basis_in Treponema pallidum subsp endemicum, which is transmitted by contact or transmitted by sharing of domestic utensils. The infection has symptom moist patches in the mouth, has symptom lumps in long bones, tissues around the mouth, nose, and roof of the mouth. These lumps destroy tissue, causing bones to be deformed and disfiguring the face.
IAO_0000412: doid.owl

glanders
type: Class
subclass of: primary bacterial infectious disease
IAO_0000115: A primary bacterial infectious disease that results in septicemic infection, has_material_basis_in Burkholderia mallei, which is transmitted by contact with tissues or body fluids of infected animals, or through mucosal surfaces such as the eyes and nose. The infection has symptom fever, has symptom chills, has symptom sweating, has symptom muscle aches, has symptom chest pain, has symptom muscle tightness, has symptom headache, has symptom mucopurulent nasal discharge, and has symptom nodular lesions in the lungs.
IAO_0000412: doid.owl

tetanus neonatorum
type: Class
subclass of: tetanus
IAO_0000115: A tetanus that occurs in newborn babies when the birth cord stump gets dirty through cutting it with an unclean blade or applying substances containing bacteria to it. The infection has symptom stiff body, has symptom muscle spasms, has symptom difficulty in breathing, and has symptom exhaustion.
IAO_0000412: doid.owl

campylobacteriosis
type: Class
subclass of: bacterial infectious disease
subclass of: gastroenteritis
IAO_0000115: A primary bacterial infectious disease that results_in infection located_in intestine, has_material_basis_in Campylobacter jejuni, which is transmitted_by ingestion of contaminated food or water or transmitted_by contact with infected people or animals. The infection has_symptom diarrhea or has_symptom dysentery, has_symptom abdominal cramps and pain, and has_symptom fever.
IAO_0000412: doid.owl

chancroid
type: Class
subclass of: primary bacterial infectious disease
subclass of: skin disease
IAO_0000115: A primary bacterial infectious disease that is a sexually transmitted infection located in skin of the genitals, has_material_basis_in Haemophilus ducreyi, which is transmitted by sexual contact. The infection has symptom painful and soft ulcers.
IAO_0000412: doid.owl

inclusion conjunctivitis
type: Class
subclass of: commensal bacterial infectious disease
subclass of: conjunctival disease
IAO_0000115: A commensal bacterial infectious disease that results_in inflammation, located_in conjunctiva of the eye, has_material_basis_in Chlamydia trachomatis, which is transmitted_by sexual contact. The infection has_symptom swollen conjunctiva and eyelids and has_symptom discharge of pus and mucus.
IAO_0000412: doid.owl

lymphogranuloma venereum
type: Class
subclass of: commensal bacterial infectious disease
subclass of: granuloma inguinale
IAO_0000115: A commensal bacterial infectious disease that results_in infection located_in lymph nodes, has_material_basis_in Chlamydia trachomatis, which is transmitted_by sexual contact, and transmitted_by fomites. The infection has_symptom inguinal lymphadenitis, has_symptom abscesses in the groin area, and has_symptom lymphangitis.
IAO_0000412: doid.owl

bacterial esophagitis
type: Class
subclass of: bacterial infectious disease
subclass of: esophagitis
IAO_0000412: doid.owl

Brucella canis brucellosis
type: Class
subclass of: brucellosis
IAO_0000115: A brucellosis involving an infection caused by Brucella canis [NCBITaxon:36855] in dogs and humans. The disease has_symptom fever, has_symptom sweats, has_symptom weakness, has_symptom weight loss, has_symptom headache, has_symptom lymphadenopathy and has_symptom splenomegaly.
IAO_0000412: doid.owl

boutonneuse fever
type: Class
subclass of: spotted fever
IAO_0000115: A spotted fever that has_material_basis_in Rickettsia conorii subsp conorii, which is transmitted_by dog tick (Rhipicephalus sanguineus). The infection has_symptom fever, has_symptom eschar (usually single), has_symptom regional adenopathy, has_symptom maculopapular rash on extremities.
IAO_0000412: doid.owl

toxic shock syndrome
type: Class
subclass of: commensal bacterial infectious disease
IAO_0000115: A commensal bacterial infectious disease that results_in infection, has_material_basis_in Streptococcus pyogenes or has_material_basis_in Staphylococcus aureus , which produce toxins that are absorbed systemically and produce the systemic manifestations. The infection has_symptom fever, has_symptom rash, has_symptom hypotension, has_symptom multiorgan failure, has_symptom desquamation, has_symptom vomiting, has_symptom diarrhea, has_symptom headache, and has_symptom nonfocal neurologic abnormalities.
IAO_0000412: doid.owl

gastrointestinal tularemia
type: Class
subclass of: tularemia
subclass of: gastrointestinal system disease
IAO_0000115: A tularemia that results in formation of ulcerative lesions located in gastrointestinal tract. The infection has symptom fever, has symptom chills, has symptom malaise, has symptom muscle aches, and has symptom vomiting.
IAO_0000412: doid.owl

ureteral disease
type: Class
subclass of: urinary system disease
IAO_0000115: A urinary system disease that is located_in the ureter.
IAO_0000412: doid.owl

Brucella melitensis brucellosis
type: Class
subclass of: brucellosis
IAO_0000115: A brucellosis that involves an infection caused by Brucella melitensis [NCBITaxon:29459] in cattle, goats, sheep and humans. The disease has_symptom fever, has_symptom malaise, has_symptom anorexia, has_symptom limb pain and has_symptom back pain.
IAO_0000412: doid.owl

Brucella abortus brucellosis
type: Class
subclass of: brucellosis
IAO_0000115: A brucellosis that involves an infection caused by Brucella abortus [NCBITaxon:235] in cattle and humans. The disease has_symptom fever, has_symptom chills, has_symptom sweats, has_symptom weight loss, has_symptom malaise, has_symptom headaches, has_symptom myalgia, and has_symptom arthralgia.
IAO_0000412: doid.owl

anaerobic meningitis
type: Class
subclass of: bacterial meningitis
IAO_0000412: doid.owl

disease of cellular proliferation
type: Class
subclass of: disease
IAO_0000115: A disease that is characterized by abnormally rapid cell division.
IAO_0000412: doid.owl

cholera
type: Class
subclass of: primary bacterial infectious disease
IAO_0000115: A primary bacterial infectious disease that is described as an acute, diarrheal illness caused by infection of the intestine with the bacterium Vibrio cholerae, which is characterized by profuse watery diarrhea, vomiting, leg cramps, circulatory collapse and shock.
IAO_0000412: doid.owl

reproductive system disease
type: Class
subclass of: disease of anatomical entity
IAO_0000115: A disease of anatomical entity that is located_in reproductive system organs.
IAO_0000412: doid.owl

pleural disease
type: Class
subclass of: lower respiratory tract disease
IAO_0000115: A thoracic disease which may involve inflammation of pleura, collection of air within the pleural cavity, abnormal collection of pleural fluid, abnormal growths on the pleura (pleural tumor) and pleural plaques. The main causes of pleural diseases including pleural effusions are congestive heart failure, malignancy, parapneumonic infections and pulmonary embolism.
IAO_0000412: doid.owl

respiratory system disease
type: Class
subclass of: disease of anatomical entity
IAO_0000115: A disease of anatomical entity that located_in the respiratory system which extends from the nasal sinuses to the diaphragm.
IAO_0000412: doid.owl

rheumatic fever
type: Class
subclass of: bacterial infectious disease
IAO_0000115: A connective tissue disease that develops from an antecedent Group A Streptococcal pharyngeal infection and has_symptom carditis, has_symptom polyarthritis, has_symptom chorea, has_symptom erythema marginatum, has_symptom subcutaneous nodules, has_symptom arthralgia, has_symptom prolonged PR interval, and/or has_symptom fever.
IAO_0000412: doid.owl

integumentary system disease
type: Class
subclass of: disease of anatomical entity
IAO_0000115: A disease of anatomical entity that is located_in the integumentary system comprising the skin and its appendages.
IAO_0000412: doid.owl

cancer
type: Class
subclass of: disease of cellular proliferation
IAO_0000115: A disease of cellular proliferation that is malignant and primary, characterized by uncontrolled cellular proliferation, local cell invasion and metastasis.
IAO_0000412: doid.owl

central nervous system tuberculosis
type: Class
subclass of: extrapulmonary tuberculosis
subclass of: central nervous system disease
IAO_0000115: An extrapulmonary tuberculosis that results in formation of tuberculomas located_in brain or located_in spinal cord.
IAO_0000412: doid.owl

skeletal tuberculosis
type: Class
subclass of: extrapulmonary tuberculosis
subclass of: bone disease
IAO_0000115: An extrapulmonary tuberculosis that results in formation of lesions located in bone.
IAO_0000412: doid.owl

cystitis
type: Class
subclass of: bladder disease
IAO_0000115: A bladder disease that is characterized by inflammation of the bladder.
IAO_0000412: doid.owl

musculoskeletal system disease
type: Class
subclass of: disease of anatomical entity
IAO_0000115: A disease of anatomical entity that occurs in the muscular and/or skeletal system.
IAO_0000412: doid.owl

urinary system disease
type: Class
subclass of: disease of anatomical entity
IAO_0000115: A disease of anatomical entity that is located_in kidney, ureter, bladder and urethra.
IAO_0000412: doid.owl

fallopian tube disease
type: Class
subclass of: female reproductive system disease
IAO_0000115: A female reproductive system disease that is located_in the fallopian tube.
IAO_0000412: doid.owl

pneumonic tularemia
type: Class
subclass of: tularemia
subclass of: lung disease
IAO_0000115: A tularemia that is located_in lungs. The bacteria are transmitted_by breathing dusts or aerosols containing the organisms. The infection has_symptom cough, has_symptom chest has_symptom pain, and has_symptom difficulty breathing.
IAO_0000412: doid.owl

tularemia
type: Class
subclass of: primary bacterial infectious disease
IAO_0000115: A primary bacterial infectious disease that has_material_basis_in Francisella tularensis, which is transmitted by dog tick bite (Dermacentor variabilis), transmitted by deer flies (Chrysops sp) or transmitted by contact with infected animal tissues.
IAO_0000412: doid.owl

tuberculous oophoritis
type: Class
subclass of: ovarian disease
subclass of: urogenital tuberculosis
IAO_0000115: An urogenital tuberculosis that results_in inflammtion located_in ovary.
IAO_0000412: doid.owl

urogenital tuberculosis
type: Class
subclass of: extrapulmonary tuberculosis
IAO_0000115: An extrapulmonary tuberculosis that is located_in urogenital system.
IAO_0000412: doid.owl

vaginitis
type: Class
subclass of: vaginal disease
IAO_0000115: A vaginal disease that is characterized by inflammation of the vagina.
IAO_0000412: doid.owl

gonadal disease
type: Class
subclass of: endocrine system disease
IAO_0000115: An endocrine system disease that is located_in the gonads.
IAO_0000412: doid.owl

female reproductive system disease
type: Class
subclass of: reproductive system disease
IAO_0000115: A reproductive system disease that impairs the ability to reproduce and is located in the uterus, vagina, cervix, ovaries or fallopian tubes.
IAO_0000412: doid.owl

leptospirosis
type: Class
subclass of: primary bacterial infectious disease
IAO_0000115: A primary bacterial infectious disease that involves systemic infection, has_material_basis_in Leptospira, which is transmitted by contact with water, food, or soil containing urine from the infected animals. The infection has symptom jaundice, has symptom chills, has symptom fever, has symptom muscle pain, and has symptom hepatomegaly.
IAO_0000412: doid.owl

nocardiosis
type: Class
subclass of: opportunistic bacterial infectious disease
IAO_0000115: An opportunistic bacterial infectious disease that results_in disseminated infection in immunocompromised hosts, has_material_basis_in Nocardia asteroides. The infection has_symptom pneumonia, has_symptom cellulitis, has_symptom lesions in the brain or meninges, and has_symptom ascending regional lymphadenopathy.
IAO_0000412: doid.owl

gastroenteritis
type: Class
subclass of: gastrointestinal system disease
IAO_0000115: A gastrointestinal system infectious disease that involves inflammation of the lining of the stomach and small and large intestines, which is caused by viruses, bacteria, or parasites. Chemicals and drugs also cause gastroenteritis. The symptoms include diarrhea, loss of appetite, nausea, vomiting, cramps, and discomfort in the abdomen.
IAO_0000412: doid.owl

thrombophilia
type: Class
subclass of: blood coagulation disease
IAO_0000115: A blood coagulation disease that is characterized by an increased tendency to form clots.
IAO_0000412: doid.owl

splenic disease
type: Class
subclass of: lymphatic system disease
IAO_0000412: doid.owl

hematologic cancer
type: Class
subclass of: organ system cancer
subclass of: hematopoietic system disease
IAO_0000115: An organ system cancer located in the hematological system that is characterized by uncontrolled cellular proliferation in blood, bone marrow and lymph nodes.
IAO_0000412: doid.owl

Mycobacterium avium complex disease
type: Class
subclass of: primary bacterial infectious disease
IAO_0000115: A primary bacterial infectious disease that results_in infection, has_material_basis_in Mycobacterium avium complex (MAC), which is transmitted_by inhalation or transmitted_by ingestion of via the respiratory or gastrointestinal tract respectively. The bacteria cause disseminated infection in HIV infected people, while pulmonary disease in immunocompetent persons.
IAO_0000412: doid.owl

endocrine system disease
type: Class
subclass of: disease of anatomical entity
IAO_0000115: A disease of anatomical entity that is located_in endocrine glands which secretes a type of hormone directly into the bloodstream to regulate the body.
IAO_0000412: doid.owl

immune system disease
type: Class
subclass of: disease of anatomical entity
IAO_0000115: A disease of anatomical entity that is located_in the immune system.
IAO_0000412: doid.owl

severe acute respiratory syndrome
type: Class
subclass of: Coronavirus infectious disease
IAO_0000115: A Coronavirus infection that results_in infection located_in respiratory tract, has_material_basis_in SARS coronavirus (SARS-CoV), which is transmitted_by droplet spread of respiratory secretions, transmitted_by ingestion of contaminated food, or transmitted_by fomites. The infection has_symptom fever, has_symptom headache, has_symptom body aches, has_symptom dry cough, and has_symptom hypoxia.
IAO_0000412: doid.owl

pulmonary tuberculosis
type: Class
subclass of: tuberculosis
subclass of: lung disease
IAO_0000115: A tuberculosis that is a contagious disease located_in lungs. The infection has_symptom fever, has_symptom cough, has_symptom difficulty in breathing, has_symptom inflammatory infiltrations, has_symptom formation of tubercles, has_symptom caseation, has_symptom pleural effusion, and has_symptom fibrosis.
IAO_0000412: doid.owl

food allergy
type: Class
subclass of: gastrointestinal allergy
IAO_0000115: A hypersensitivity reaction type I disease that is an abnormal response to a food, triggered by the body's immune system.
IAO_0000412: doid.owl

paratyphoid fever
type: Class
subclass of: primary bacterial infectious disease
IAO_0000115: A primary bacterial infectious disease that results_in infection located_in intestine, has_material_basis_in Salmonella enterica subsp enterica serovar Paratyphi A, B or C, which are transmitted_by ingestion of contaminated food. The infection has_symptom fever, has_symptom headache, has_symptom abdominal pain, has_symptom malaise, has_symptom anorexia, has_symptom constipation, has_symptom rosy spots on the central body, has_symptom non productive cough (in early stage of illness), has_symptom bradycardia, and has_symptom hepatosplenomegaly.
IAO_0000412: doid.owl

Acinetobacter infectious disease
type: Class
subclass of: opportunistic bacterial infectious disease
IAO_0000115: An opportunistic bacterial infectious disease that has_material_basis_in Acinetobacter.
IAO_0000412: doid.owl

hepatobiliary disease
type: Class
subclass of: gastrointestinal system disease
IAO_0000115: A gastrointestinal system disease that is located_in the liver and/or biliary tract.
IAO_0000412: doid.owl

spinal cord disease
type: Class
subclass of: central nervous system disease
IAO_0000412: doid.owl

central nervous system disease
type: Class
subclass of: nervous system disease
IAO_0000115: A nervous system disease that affects either the spinal cord (myelopathy) or brain (encephalopathy) of the central nervous system.
IAO_0000412: doid.owl

bacterial vaginosis
type: Class
subclass of: bacterial infectious disease
subclass of: vaginitis
IAO_0000115: A vaginitis that is characterized by a grayish vaginal discharge usually of foul odor and the presence of Gardnerella vaginalis.
IAO_0000412: doid.owl

breast disease
type: Class
subclass of: thoracic disease
IAO_0000115: A thoracic disease that is located_in the breast.
IAO_0000412: doid.owl

septicemic plague
type: Class
subclass of: cardiovascular system disease
subclass of: plague
IAO_0000115: A plague that results_in infection located_in vasculature where bacterial endotoxins cause coagulation, which leads to formation of tiny clots throughout the body. The infection has_symptom fever, has_symptom chills, has_symptom prostration, has_symptom abdominal pain, has_symptom shock and has_symptom bleeding into skin and other organs.
IAO_0000412: doid.owl

plague
type: Class
subclass of: primary bacterial infectious disease
IAO_0000115: A primary bacterial infectious disease that results_in infection, located_in lymph node, located_in vasculature or located_in lungs, has_material_basis_in Yersinia pestis, which is transmitted_by oriental rat flea (Xenopsylla cheopis) infected by feeding on rodents and other mammals, transmitted_by air, transmitted_by direct contact or transmitted_by ingestion of contaminated undercooked food.
IAO_0000412: doid.owl

bladder disease
type: Class
subclass of: urinary system disease
IAO_0000115: A urinary system disease that is located_in the bladder.
IAO_0000412: doid.owl

wheat allergy
type: Class
subclass of: food allergy
IAO_0000115: A food allergy that develops_from exposure to and particularly consumption of wheat, and has_symptom that are both gastrointestinal and nongastrointestinal in nature, such as diarrhea, mouth and throat irritation, headache, hives, skin rashes, and anaphylaxis.
IAO_0000412: doid.owl

skin disease
type: Class
subclass of: integumentary system disease
IAO_0000115: An integumentary system disease that is located_in skin.
IAO_0000412: doid.owl

extrinsic cardiomyopathy
type: Class
subclass of: cardiomyopathy
IAO_0000115: A cardiomyopathy that is characterized by the pathology occuring outside of the myocardium.
IAO_0000412: doid.owl

tuberculosis
type: Class
subclass of: primary bacterial infectious disease
IAO_0000115: A primary bacterial infectious disease that is located_in lungs, located_in lymph nodes, located_in pericardium, located_in brain, located_in pleura or located_in gastrointestinal tract, has_material_basis_in Mycobacterium tuberculosis, which is transmitted_by droplets released into the air when an infected person coughs or sneezes.
IAO_0000412: doid.owl

disease
type: Class
IAO_0000115: A disease is a disposition (i) to undergo pathological processes that (ii) exists in an organism because of one or more disorders in that organism.
IAO_0000412: doid.owl

multidrug-resistant tuberculosis
type: Class
subclass of: tuberculosis
IAO_0000115: A tuberculosis that is resistant to isoniazid and rifampicin, the two most powerful first-line anti-TB drugs.
IAO_0000412: doid.owl

oral tuberculosis
type: Class
subclass of: mouth disease
subclass of: gastrointestinal tuberculosis
IAO_0000115: A gastrointestinal tuberculosis that involves formation of painful ulcerative mucosal lesions located in tongue, located in palate, located in maxilla or located in mandible.
IAO_0000412: doid.owl

gastritis
type: Class
subclass of: stomach disease
IAO_0000115: A stomach disease that is an inflammation of the lining of the stomach.
IAO_0000412: doid.owl

mouth disease
type: Class
subclass of: gastrointestinal system disease
IAO_0000115: A gastrointestinal system disease that is located_in the mouth.
IAO_0000412: doid.owl

bacterial gastritis
type: Class
subclass of: bacterial infectious disease
subclass of: gastritis
IAO_0000115: A gastritis that involves inflammation of the stomach lining caused by bacteria. The disease has_symptom abdominal pain, has_symptom indigestion, has_symptom ulcer formation, has_symptom abdominal bloating, has_symptom nausea and has_symptom vomiting.
IAO_0000412: doid.owl

gastrointestinal tuberculosis
type: Class
subclass of: abdominal tuberculosis
IAO_0000115: An abdominal tuberculosis that results_in infection located_in gastrointestinal tract. The infection has_symptom abdominal pain, has_symptom weight loss, has_symptom fever, has_symptom anorexia, has_symptom change in bowel habits, has_symptom nausea, and has_symptom vomiting.
IAO_0000412: doid.owl

hepatic tuberculosis
type: Class
subclass of: gastrointestinal tuberculosis
subclass of: liver disease
IAO_0000115: A gastrointestinal tuberculosis that involves infection located_in liver, which results in the formation of tuberculous granulomas. The infection has_symptom fever, has_symptom anorexia, has_symptom weight loss, has_symptom abdominal pain and has_symptom jaundice.
IAO_0000412: doid.owl

liver disease
type: Class
subclass of: hepatobiliary disease
IAO_0000412: doid.owl

primary syphilis
type: Class
subclass of: syphilis
IAO_0000115: A syphilis that is the first stage of syphilis, marked by the development of a chancre, which is characterized by mononuclear leukocytic infiltration, macrophages, and lymphocytes.
IAO_0000412: doid.owl

secondary syphilis
type: Class
subclass of: syphilis
IAO_0000115: A syphilis that is characterized as the second stage of syphilis which appears from 2 to 6 months after primary infection, and is marked by lesions especially in the skin but also in organs and tissues, and that lasts from 3 to 12 weeks.
IAO_0000412: doid.owl

syphilis
type: Class
subclass of: primary bacterial infectious disease
IAO_0000115: A primary bacterial infectious disease that is a sexually transmitted systemic disease, has_material_basis_in Treponema pallidum subsp pallidum, which is transmitted_by sexual contact, transmitted_by blood product transfusion, transmitted_by congenital method from mother to fetus or transmitted_by contact with infectious lesions. If left untreated, produces chancres, rashes, and systemic lesions in a clinical course with three stages continued over many years.
IAO_0000412: doid.owl

autoimmune disease
type: Class
subclass of: primary immunodeficiency disease
IAO_0000115: An immune system disease that is an overactive immune response of the body against substances and tissues normally present in the body resulting from an abnormal functioning of the immune system that results in the production of antibodies or T cell directed against the host tissues.
IAO_0000412: doid.owl

conjunctival disease
type: Class
subclass of: eye disease
IAO_0000115: An eye disease affecting the conjunctiva, which is the mucous membrane surrounding the eye and interior of the eyelids.
IAO_0000412: doid.owl

milk allergy
type: Class
subclass of: food allergy
IAO_0000115: A food allergy that results in adverse immune reaction to one or more of the proteins in cow's milk and/or the milk of other animals, which are normally harmless to the non-allergic individual.
IAO_0000412: doid.owl

egg allergy
type: Class
subclass of: food allergy
IAO_0000115: A food allergy that is an allergy or hypersensitivity to dietary substances from the yolk or whites of eggs, causing an overreaction of the immune system which may lead to severe physical symptoms.
IAO_0000412: doid.owl

peanut allergy
type: Class
subclass of: legume allergy
IAO_0000115: A legume allergy that is an allergy or hypersensitivity to dietary substances from peanuts causing an overreaction of the immune system which in a small percentage of people may lead to severe physical symptoms.
IAO_0000412: doid.owl

nut allergy
type: Class
subclass of: food allergy
IAO_0000115: A food allergy that develops_from exposure to and particularly consumption of nuts, and has_symptom asthma, skin rashes, throat and eye irritation, and anaphylaxis.
IAO_0000412: doid.owl

male reproductive system disease
type: Class
subclass of: reproductive system disease
IAO_0000115: A reproductive system disease that affects male reproductive organs.
IAO_0000412: doid.owl

lymph node tuberculosis
type: Class
subclass of: extrapulmonary tuberculosis
subclass of: lymph node disease
IAO_0000115: An extrapulmonary tuberculosis that is located_in lymph node, and has_symptom lymphadenopathy, has_symptom fever, has_symptom weight loss, has_symptom fatigue, has_symptom night sweats and has_symptom cough.
IAO_0000412: doid.owl

pericardial tuberculosis
type: Class
subclass of: extrapulmonary tuberculosis
subclass of: pericardium disease
IAO_0000115: An extrapulmonary tuberculosis that is located_in pericardium resulting in acute pericarditis, chronic pericardial effusion, cardiac tamponade or pericardial constriction.
IAO_0000412: doid.owl

actinobacillosis
type: Class
subclass of: commensal bacterial infectious disease
subclass of: respiratory system disease
IAO_0000115: A commensal bacterial infectious disease that results_in infection, has_material_basis_in Actinobacillus ureae, which is a commensal of the human respiratory tract. The pathogen causes meningitis, endocarditis, bacteremia, atrophic rhinitis, bronchitis, pneumonia, conjunctivitis, peritonitis, and otitis media.
IAO_0000412: doid.owl

melioidosis
type: Class
subclass of: primary bacterial infectious disease
IAO_0000115: A primary bacterial infectious disease that results_in infection, has_material_basis_in Burkholderia pseudomallei, which is transmitted_by contact with the contaminated water or soil. The infection has_symptom fever, has_symptom respiratory distress, has_symptom chest pain, and has_symptom stomach pain.
IAO_0000412: doid.owl

intestinal disease
type: Class
subclass of: gastrointestinal system disease
IAO_0000115: A gastrointestinal system disease that is located_in the intestine.
IAO_0000412: doid.owl

colonic disease
type: Class
subclass of: intestinal disease
IAO_0000115: A intestinal disease located in the colon.
IAO_0000412: doid.owl

pneumonia
type: Class
subclass of: lung disease
IAO_0000115: A lung disease that involves lung parenchyma or alveolar inflammation and abnormal alveolar filling with fluid (consolidation and exudation). It results from a variety of causes including infection with bacteria, viruses, fungi or parasites, and chemical or physical injury to the lungs. It is accompanied by fever, chills, cough, and difficulty in breathing.
IAO_0000412: doid.owl

kidney disease
type: Class
subclass of: urinary system disease
IAO_0000115: A urinary system disease that is located_in the kidney.
IAO_0000412: doid.owl

eye disease
type: Class
subclass of: sensory system disease
IAO_0000115: An eye and adnexa disease that is located_in the eye.
IAO_0000412: doid.owl

esophageal disease
type: Class
subclass of: gastrointestinal system disease
IAO_0000115: A gastrointestinal system disease that is located_in the esophagus.
IAO_0000412: doid.owl

primary immunodeficiency disease
type: Class
subclass of: immune system disease
IAO_0000115: An immune system disease that results when one or more essential parts of the immune system is missing or not working properly at birth due to a genetic mutation.
IAO_0000412: doid.owl

conjunctivitis
type: Class
subclass of: conjunctival disease
IAO_0000115: A conjunctival disease characterized by an inflammation of the conjunctiva, the outermost layer of the eye and the inner surface of the eyelids.
IAO_0000412: doid.owl

connective tissue disease
type: Class
subclass of: musculoskeletal system disease
IAO_0000115: A musculoskeletal system disease that affects tissues such as skin, tendons, and cartilage.
IAO_0000412: doid.owl

disease of anatomical entity
type: Class
IAO_0000115: A disease that manifests in a defined anatomical structure.
IAO_0000412: doid.owl

esophageal tuberculosis
type: Class
subclass of: gastrointestinal tuberculosis
subclass of: esophageal disease
IAO_0000115: A gastrointestinal tuberculosis that involves formation of tuberculous ulcers located_in esophagus. The infection has_symptom dysphagia, has_symptom cough, has_symptom chest pain, has_symptom fever and has_symptom weight loss.
IAO_0000412: doid.owl

hematopoietic system disease
type: Class
subclass of: disease of anatomical entity
IAO_0000115: A disease of anatomical entity that has_material_basis_in hematopoietic cells.
IAO_0000412: doid.owl

cutaneous anthrax
type: Class
subclass of: skin disease
subclass of: anthrax disease
IAO_0000115: An anthrax disease that results_in infection located_in skin, has_material_basis_in Bacillus anthracis, which is transmitted_by contact with infected animals or animal products. The infection has_symptom skin lesion that eventually forms an ulcer with a black center.
IAO_0000412: doid.owl

anthrax disease
type: Class
subclass of: primary bacterial infectious disease
IAO_0000115: A primary bacterial infectious disease that results_in infection located_in skin, located_in lung lymph nodes or located_in gastrointestinal tract, has_material_basis_in Bacillus anthracis, transmitted_by contact with infected animals or animal products, transmitted_by airborne spores or transmitted_by ingestion of undercooked meat from infected animals and has_symptom skin ulcer, has_symptom nausea, has_symptom poor appetite, has_symptom bloody diarrhea, has_symptom fever or has_symptom shortness of breath.
IAO_0000412: doid.owl

lymphatic system disease
type: Class
subclass of: immune system disease
IAO_0000115: An immune system disease that is located_in the lymphatic system.
IAO_0000412: doid.owl

bladder tuberculosis
type: Class
subclass of: urogenital tuberculosis
subclass of: bladder disease
IAO_0000115: An urogenital tuberculosis that is located_in urinary bladder, which results in fibrosis of bladder wall muscles.
IAO_0000412: doid.owl

gonorrhea
type: Class
subclass of: primary bacterial infectious disease
subclass of: fallopian tube disease
IAO_0000115: A primary bacterial infectious disease that is a sexually transmitted infection, located_in uterus, located_in fallopian tube, located_in urethra, located_in mouth, located_in throat, located_in eye or located_in anus, has_material_basis_in Neisseria gonorrhoeae, which is transmitted_by contact with the penis, vagina, mouth, or anus or transmitted_by congenitally from mother to baby during delivery. The infection has_symptom burning sensation during urination, has_symptom discharge from the penis, has_symptom increased vaginal discharge, or has_symptom vaginal bleeding between periods.
IAO_0000412: doid.owl

stomach disease
type: Class
subclass of: gastrointestinal system disease
IAO_0000115: A gastrointestinal system disease that is located_in the stomach.
IAO_0000412: doid.owl

gastrointestinal system disease
type: Class
subclass of: disease of anatomical entity
IAO_0000115: A disease of anatomical entity that is located_in the gastrointestinal tract.
IAO_0000412: doid.owl

myocarditis
type: Class
subclass of: extrinsic cardiomyopathy
IAO_0000115: An extrinsic cardiomyopathy that is characterized as an inflammation of the heart muscle.
IAO_0000412: doid.owl

tertiary syphilis
type: Class
subclass of: syphilis
IAO_0000115: A syphilis that is characterized as the third stage of syphilis that develops after the disappearance of the secondary symptoms and is marked by ulcers and gummas under the skin and commonly by involvement of the skeletal, cardiovascular, and nervous systems.
IAO_0000412: doid.owl

ureter tuberculosis
type: Class
subclass of: ureteral disease
subclass of: urogenital tuberculosis
IAO_0000115: An urogenital tuberculosis that is located_in ureter resulting in ureteral strictures.
IAO_0000412: doid.owl

peritonitis
type: Class
subclass of: gastrointestinal system disease
IAO_0000115: A gastrointestinal system disease that involves inflammation of the peritoneum resulting from perforation of the gastrointestinal tract, which produces immediate chemical inflammation followed shortly by infection from intestinal organisms. Peritonitis can also result from appendicitis, diverticulitis, strangulating intestinal obstruction, pancreatitis, pelvic inflammatory disease, mesenteric ischemia, intraperitoneal blood, barium, or peritoneo-systemic shunts, drains, and dialysis catheters in the peritoneal cavity. The symptoms include abdominal pain and tenderness, fever, fluid in the abdomen, nausea, vomiting and low urine output.
IAO_0000412: doid.owl

actinomycosis
type: Class
subclass of: commensal bacterial infectious disease
subclass of: respiratory system disease
IAO_0000115: A commensal bacterial infectious disease that results in infection, which is characterized by contiguous spread, suppurative and granulomatous inflammation, and formation of multiple abscesses and sinus tracts that may discharge sulfur granules, has_material_basis_in Actinomyces israelii, has_material_basis_in Actinomyces gerencseriae, has_material_basis_in Actinomyces naeslundii, has_material_basis_in Actinomyces odontolyticus, has_material_basis_in Actinomyces viscosus, has_material_basis_in Actinomyces meyeri, has_material_basis_in Propionibacterium propionicum, which require a break in the integrity of the mucous membranes and the presence of devitalized tissue to invade deeper body structures.
IAO_0000412: doid.owl

rheumatic myocarditis
type: Class
subclass of: bacterial infectious disease
subclass of: myocarditis
IAO_0000412: doid.owl

lung disease
type: Class
subclass of: lower respiratory tract disease
IAO_0000115: A lower respiratory tract disease in which the function of the lungs is adversely affected by narrowing or blockage of the airways resulting in poor air flow, a loss of elasticity in the lungs that produces a decrease in the total volume of air that the lungs are able to hold, and clotting, scarring, or inflammation of the blood vessels that affect the ability of the lungs to take up oxygen and to release carbon dioxide.
IAO_0000412: doid.owl

ulcerative colitis
type: Class
subclass of: autoimmune disease of gastrointestinal tract
subclass of: colitis
IAO_0000115: A colitis that is predominantly confined to the mucosa located_in colon and includes characteristic ulcers, or open sores.
IAO_0000412: doid.owl

nervous system disease
type: Class
subclass of: disease of anatomical entity
IAO_0000115: A disease of anatomical entity that is located_in the central nervous system or located_in the peripheral nervous system.
IAO_0000412: doid.owl

anaerobic pneumonia
type: Class
subclass of: aspiration pneumonia
IAO_0000115: An aspiration pneumonia caused by anaerobic bacteria like Bacteroides fragilis, Peptostreptococcus, anaerobic streptococci, Fusobacterium species (Fusobacterium nucleatum and Fusobacterium necrophoram). Lung abscess and empyema are diagnosed in this disease.
IAO_0000412: doid.owl

bacterial pneumonia
type: Class
subclass of: bacterial infectious disease
subclass of: pneumonia
IAO_0000115: A pneumonia involving inflammation of the lungs caused by bacteria.
IAO_0000412: doid.owl

Ritter's disease
type: Class
subclass of: commensal bacterial infectious disease
subclass of: skin disease
IAO_0000115: A commensal bacterial infectious disease that is characterized by widespread erythema, peeling, and necrosis of the skin, that is caused by a toxin produced by a bacterium of the genus Staphylococcus (S. aureus). The infection has_symptoms redness of skin, has_symptom fluid-filled blister formation, has_symptom fever and has_symptom irritability.
IAO_0000412: doid.owl

granuloma inguinale
type: Class
subclass of: primary bacterial infectious disease
IAO_0000115: A primary bacterial infectious disease that results_in infection located_in skin or located_in mucosa of genital tract, has_material_basis_in Klebsiella granulomatis, transmitted by sexual contact or transmitted_by contact with the open sores. The infection has_symptom painless genital ulcers.
IAO_0000412: doid.owl

gas gangrene
type: Class
subclass of: commensal bacterial infectious disease
subclass of: muscular disease
IAO_0000115: A commensal bacterial infectious disease that results in infection, located in muscle tissue, has_material_basis_in Clostridium perfringens, which produce gas that becomes trapped in the infected tissue. Gas gangrene usually develops after injuries or surgery. The infection has symptom large blisters, has symptom pain in the infected area, has symptom myonecrosis, has symptom gas production, and has symptom sepsis.
IAO_0000412: doid.owl

splenic tuberculosis
type: Class
subclass of: abdominal tuberculosis
subclass of: splenic disease
IAO_0000115: An abdominal tuberculosis that results_in formation of granulomas or abscesses located_in spleen.
IAO_0000412: doid.owl

viral infectious disease
type: Class
subclass of: disease by infectious agent
IAO_0000115: A disease by infectious agent that results in infection, has_material_basis_in Viruses.
IAO_0000412: doid.owl

brain disease
type: Class
subclass of: central nervous system disease
IAO_0000115: A central nervous system disease that is located_in the brain.
IAO_0000412: doid.owl

vesiculitis
type: Class
subclass of: male reproductive system disease
IAO_0000412: doid.owl

bacterial meningitis
type: Class
subclass of: bacterial infectious disease
subclass of: meningitis
IAO_0000115: A meningitis that has_material_basis_in a bacterial infection.
IAO_0000412: doid.owl

meningitis
type: Class
subclass of: central nervous system disease
IAO_0000115: A central nervous system disease that is characterized by an inflammation of the pia-arachnoid meninges. It can be caused by growth of bacteria, fungi, or parasites within the subarachnoid space or by the growth of bacteria or viruses within the meningeal or ependymal cells.
IAO_0000412: doid.owl

latent syphilis
type: Class
subclass of: syphilis
IAO_0000115: A syphilis that is characterized as having serologic proof of infection without signs or symptoms of disease.
IAO_0000412: doid.owl

encephalitis
type: Class
subclass of: brain disease
IAO_0000115: A brain disease that is characterized as an acute inflammation of the brain with flu-like symptoms.
IAO_0000412: doid.owl

staphyloenterotoxemia
type: Class
subclass of: primary bacterial infectious disease
IAO_0000115: A primary bacterial infectious disease that results_in infection located_in intestine caused by eating food contaminated with enterotoxins produced by bacteria, has_material_basis_in Staphylococcus aureus. The infection has_symptom diarrhea, has_symptom vomiting, has_symptom nausea, has_symptom cramps, and has_symptom weakness.
IAO_0000412: doid.owl

ophthalmia neonatorum
type: Class
subclass of: bacterial conjunctivitis
IAO_0000115: A bacterial conjuctivitis that is characterized by pain and tenderness in the eyeball and conjuctival discharge.
IAO_0000412: doid.owl

bacterial conjunctivitis
type: Class
subclass of: bacterial infectious disease
subclass of: conjunctivitis
IAO_0000412: doid.owl

renal tuberculosis
type: Class
subclass of: urogenital tuberculosis
subclass of: kidney disease
IAO_0000115: An urogenital tuberculosis that results_in formation of granulomas located_in kidney.
IAO_0000412: doid.owl

tuberculous peritonitis
type: Class
subclass of: gastrointestinal tuberculosis
IAO_0000115: A gastrointestinal tuberculosis that results_in inflammation located_in peritoneum, which results in formation of tubercles. The infection has_symptom abdominal discomfort, has_symptom pain, has_symptom distention from gas or fluid, has_symptom digestive disturbances and has_symptom emaciation.
IAO_0000412: doid.owl

congenital syphilis
type: Class
subclass of: physical disorder
subclass of: syphilis
IAO_0000115: A syphilis that results_in a multisystem infection in the fetus via the placenta.
IAO_0000412: doid.owl

miliary tuberculosis
type: Class
subclass of: extrapulmonary tuberculosis
IAO_0000115: An extrapulmonary tuberculosis that results in formation of tiny lesions in all the organs.
IAO_0000412: doid.owl

cardiovascular syphilis
type: Class
subclass of: tertiary syphilis
IAO_0000115: A tertiary syphilis that is manifested as aneurysm formation in the ascending aorta, caused by chronic inflammatory destruction of the vasa vasorum, insufficiency of the aortic valve, or narrowing of the coronary arteries.
IAO_0000412: doid.owl

lymph node disease
type: Class
subclass of: lymphatic system disease
IAO_0000412: doid.owl

tertiary neurosyphilis
type: Class
subclass of: spinal cord disease
subclass of: tertiary syphilis
subclass of: brain disease
IAO_0000115: A tertiary syphilis that results in infection located in brain or located in spinal cord.
IAO_0000412: doid.owl

skin lesion
type: Class
subclass of: skin and integumentary tissue symptom
IAO_0000412: doid.owl

symptom
type: Class
IAO_0000412: doid.owl

skin and integumentary tissue symptom
type: Class
subclass of: symptom
IAO_0000412: doid.owl