reproduction
type: Class
subclass of: biological_process
IAO_0000115: The production of new individuals that contain some portion of genetic material inherited from one or more parent organisms.
has exact synonym: reproductive physiological process

Axiom
annotated source: reproduction
annotated property: IAO_0000115
annotated target: The production of new individuals that contain some portion of genetic material inherited from one or more parent organisms.
has db xref: GOC:go_curators
has db xref: GOC:isa_complete
has db xref: GOC:jl
has db xref: ISBN:0198506732

mitotic cell cycle
type: Class
equivalent class: Class
  intersection of: cell cycle
  intersection of: Restriction
    on property: BFO_0000051
    some values from: mitotic nuclear division
subclass of: cell cycle
subclass of: Restriction
  on property: BFO_0000051
  some values from: mitotic nuclear division
IAO_0000115: Progression through the phases of the mitotic cell cycle, the most common eukaryotic cell cycle, which canonically comprises four successive phases called G1, S, G2, and M and includes replication of the genome and the subsequent segregation of chromosomes into daughter cells. In some variant cell cycles nuclear replication or nuclear division may not be followed by cell division, or G1 and G2 phases may be absent.
has related synonym: mitosis

Axiom
annotated source: mitotic cell cycle
annotated property: IAO_0000115
annotated target: Progression through the phases of the mitotic cell cycle, the most common eukaryotic cell cycle, which canonically comprises four successive phases called G1, S, G2, and M and includes replication of the genome and the subsequent segregation of chromosomes into daughter cells. In some variant cell cycles nuclear replication or nuclear division may not be followed by cell division, or G1 and G2 phases may be absent.
has db xref: GOC:mah
has db xref: ISBN:0815316194
has db xref: Reactome:69278

nuclear division
type: Class
subclass of: organelle fission
IAO_0000115: The division of a cell nucleus into two nuclei, with DNA and other nuclear contents distributed between the daughter nuclei.
has related synonym: karyokinesis

Axiom
annotated source: nuclear division
annotated property: IAO_0000115
annotated target: The division of a cell nucleus into two nuclei, with DNA and other nuclear contents distributed between the daughter nuclei.
has db xref: GOC:mah

developmental process involved in reproduction
type: Class
equivalent class: Class
  intersection of: developmental process
  intersection of: Restriction
    on property: BFO_0000050
    some values from: reproduction
subclass of: reproductive process
subclass of: developmental process
IAO_0000115: A developmental process in which a progressive change in the state of some part of an organism, germline or somatic, specifically contributes to its ability to form offspring.
has narrow synonym: puberty
has related synonym: reproductive developmental process

Axiom
annotated source: developmental process involved in reproduction
annotated property: IAO_0000115
annotated target: A developmental process in which a progressive change in the state of some part of an organism, germline or somatic, specifically contributes to its ability to form offspring.
has db xref: GOC:dph
has db xref: GOC:isa_complete

Axiom
annotated source: developmental process involved in reproduction
annotated property: hasNarrowSynonym
annotated target: puberty
has db xref: GOC:dph

Axiom
annotated source: developmental process involved in reproduction
annotated property: hasRelatedSynonym
annotated target: reproductive developmental process
has db xref: GOC:dph
has db xref: GOC:tb

molecular_function
type: Class
IAO_0000115: A molecular process that can be carried out by the action of a single macromolecular machine, usually via direct physical interactions with other molecular entities. Function in this sense denotes an action, or activity, that a gene product (or a complex) performs.
has exact synonym: molecular function

Axiom
annotated source: molecular_function
annotated property: IAO_0000115
annotated target: A molecular process that can be carried out by the action of a single macromolecular machine, usually via direct physical interactions with other molecular entities. Function in this sense denotes an action, or activity, that a gene product (or a complex) performs.
has db xref: GOC:pdt

catalytic activity
type: Class
subclass of: molecular_function
IAO_0000115: Catalysis of a biochemical reaction at physiological temperatures. In biologically catalyzed reactions, the reactants are known as substrates, and the catalysts are naturally occurring macromolecular substances known as enzymes. Enzymes possess specific binding sites for substrates, and are usually composed wholly or largely of protein, but RNA that has catalytic activity (ribozyme) is often also regarded as enzymatic.
has exact synonym: enzyme activity

Axiom
annotated source: catalytic activity
annotated property: IAO_0000115
annotated target: Catalysis of a biochemical reaction at physiological temperatures. In biologically catalyzed reactions, the reactants are known as substrates, and the catalysts are naturally occurring macromolecular substances known as enzymes. Enzymes possess specific binding sites for substrates, and are usually composed wholly or largely of protein, but RNA that has catalytic activity (ribozyme) is often also regarded as enzymatic.
has db xref: GOC:vw
has db xref: ISBN:0198506732

Axiom
annotated source: catalytic activity
annotated property: hasExactSynonym
annotated target: enzyme activity
has db xref: GOC:dph
has db xref: GOC:tb

acid phosphatase activity
type: Class
subclass of: phosphatase activity
IAO_0000115: Catalysis of the reaction: an orthophosphoric monoester + H2O = an alcohol + phosphate, with an acid pH optimum.
has broad synonym: glycerophosphatase activity
has broad synonym: phosphomonoesterase activity
has related synonym: acid monophosphatase activity
has related synonym: acid nucleoside diphosphate phosphatase activity
has related synonym: acid phosphohydrolase activity
has related synonym: acid phosphomonoester hydrolase activity
has related synonym: acid phosphomonoesterase activity
has related synonym: orthophosphoric-monoester phosphohydrolase (acid optimum)
has related synonym: phosphate-monoester phosphohydrolase (acid optimum)
has related synonym: uteroferrin

Axiom
annotated source: acid phosphatase activity
annotated property: IAO_0000115
annotated target: Catalysis of the reaction: an orthophosphoric monoester + H2O = an alcohol + phosphate, with an acid pH optimum.
has db xref: EC:3.1.3.2

Axiom
annotated source: acid phosphatase activity
annotated property: hasBroadSynonym
annotated target: glycerophosphatase activity
has db xref: EC:3.1.3.2

Axiom
annotated source: acid phosphatase activity
annotated property: hasBroadSynonym
annotated target: phosphomonoesterase activity
has db xref: EC:3.1.3.2

Axiom
annotated source: acid phosphatase activity
annotated property: hasRelatedSynonym
annotated target: acid monophosphatase activity
has db xref: EC:3.1.3.2

Axiom
annotated source: acid phosphatase activity
annotated property: hasRelatedSynonym
annotated target: acid nucleoside diphosphate phosphatase activity
has db xref: EC:3.1.3.2

Axiom
annotated source: acid phosphatase activity
annotated property: hasRelatedSynonym
annotated target: acid phosphohydrolase activity
has db xref: EC:3.1.3.2

Axiom
annotated source: acid phosphatase activity
annotated property: hasRelatedSynonym
annotated target: acid phosphomonoester hydrolase activity
has db xref: EC:3.1.3.2

Axiom
annotated source: acid phosphatase activity
annotated property: hasRelatedSynonym
annotated target: acid phosphomonoesterase activity
has db xref: EC:3.1.3.2

Axiom
annotated source: acid phosphatase activity
annotated property: hasRelatedSynonym
annotated target: orthophosphoric-monoester phosphohydrolase (acid optimum)
has db xref: EC:3.1.3.2

Axiom
annotated source: acid phosphatase activity
annotated property: hasRelatedSynonym
annotated target: phosphate-monoester phosphohydrolase (acid optimum)
has db xref: EC:3.1.3.2

Axiom
annotated source: acid phosphatase activity
annotated property: hasRelatedSynonym
annotated target: uteroferrin
has db xref: EC:3.1.3.2

hydrolase activity, hydrolyzing O-glycosyl compounds
type: Class
subclass of: hydrolase activity, acting on glycosyl bonds
IAO_0000115: Catalysis of the hydrolysis of any O-glycosyl bond.
has exact synonym: O-glucosyl hydrolase activity

Axiom
annotated source: hydrolase activity, hydrolyzing O-glycosyl compounds
annotated property: IAO_0000115
annotated target: Catalysis of the hydrolysis of any O-glycosyl bond.
has db xref: GOC:mah

alpha-amylase activity
type: Class
subclass of: amylase activity
IAO_0000115: Catalysis of the endohydrolysis of (1->4)-alpha-D-glucosidic linkages in polysaccharides containing three or more alpha-(1->4)-linked D-glucose units.
has broad synonym: glycogenase activity
has narrow synonym: alpha-amylase activity (releasing maltohexaose)
has related synonym: 1,4-alpha-D-glucan glucanohydrolase activity
has related synonym: alpha amylase activity
has related synonym: endoamylase activity
has related synonym: taka-amylase A

Axiom
annotated source: alpha-amylase activity
annotated property: IAO_0000115
annotated target: Catalysis of the endohydrolysis of (1->4)-alpha-D-glucosidic linkages in polysaccharides containing three or more alpha-(1->4)-linked D-glucose units.
has db xref: PMID:12527308

Axiom
annotated source: alpha-amylase activity
annotated property: hasBroadSynonym
annotated target: glycogenase activity
has db xref: EC:3.2.1.1

beta-fructofuranosidase activity
type: Class
subclass of: hydrolase activity, hydrolyzing O-glycosyl compounds
IAO_0000115: Catalysis of the reaction: a fructofuranosylated fructofuranosyl acceptor + H2O = a non fructofuranosylated fructofuranosyl acceptor + a beta-D-fructofuranoside.
has broad synonym: acid invertase activity
has broad synonym: alkaline invertase activity
has broad synonym: invertase activity
has broad synonym: invertin activity
has exact synonym: beta-D-fructofuranoside fructohydrolase activity
has related synonym: beta-fructosidase activity
has related synonym: beta-h-fructosidase activity
has related synonym: fructosylinvertase activity
has related synonym: glucosucrase activity
has related synonym: maxinvert L 1000 activity
has related synonym: saccharase activity

Axiom
annotated source: beta-fructofuranosidase activity
annotated property: IAO_0000115
annotated target: Catalysis of the reaction: a fructofuranosylated fructofuranosyl acceptor + H2O = a non fructofuranosylated fructofuranosyl acceptor + a beta-D-fructofuranoside.
has db xref: EC:3.2.1.26
has db xref: MetaCyc:RXN-9985

signaling receptor binding
type: Class
subclass of: protein binding
IAO_0000115: Binding to one or more specific sites on a receptor molecule, a macromolecule that undergoes combination with a hormone, neurotransmitter, drug or intracellular messenger to initiate a change in cell function.
has broad synonym: receptor binding
has narrow synonym: receptor ligand
has related synonym: receptor-associated protein activity

Axiom
annotated source: signaling receptor binding
annotated property: IAO_0000115
annotated target: Binding to one or more specific sites on a receptor molecule, a macromolecule that undergoes combination with a hormone, neurotransmitter, drug or intracellular messenger to initiate a change in cell function.
has db xref: GOC:bf
has db xref: GOC:ceb
has db xref: ISBN:0198506732

binding
type: Class
subclass of: molecular_function
IAO_0000115: The selective, non-covalent, often stoichiometric, interaction of a molecule with one or more specific sites on another molecule.
has narrow synonym: ligand

Axiom
annotated source: binding
annotated property: IAO_0000115
annotated target: The selective, non-covalent, often stoichiometric, interaction of a molecule with one or more specific sites on another molecule.
has db xref: GOC:ceb
has db xref: GOC:mah
has db xref: ISBN:0198506732

protein binding
type: Class
subclass of: binding
IAO_0000115: Binding to a protein.
has exact synonym: protein amino acid binding
has narrow synonym: glycoprotein binding

Axiom
annotated source: protein binding
annotated property: IAO_0000115
annotated target: Binding to a protein.
has db xref: GOC:go_curators

cellular_component
type: Class
IAO_0000115: A location, relative to cellular compartments and structures, occupied by a macromolecular machine when it carries out a molecular function. There are two ways in which the gene ontology describes locations of gene products: (1) relative to cellular structures (e.g., cytoplasmic side of plasma membrane) or compartments (e.g., mitochondrion), and (2) the stable macromolecular complexes of which they are parts (e.g., the ribosome).
has exact synonym: cell or subcellular entity
has exact synonym: cellular component
has related synonym: subcellular entity

Axiom
annotated source: cellular_component
annotated property: IAO_0000115
annotated target: A location, relative to cellular compartments and structures, occupied by a macromolecular machine when it carries out a molecular function. There are two ways in which the gene ontology describes locations of gene products: (1) relative to cellular structures (e.g., cytoplasmic side of plasma membrane) or compartments (e.g., mitochondrion), and (2) the stable macromolecular complexes of which they are parts (e.g., the ribosome).
has db xref: GOC:pdt
has db xref: NIF_Subcellular:sao1337158144

Axiom
annotated source: cellular_component
annotated property: hasRelatedSynonym
annotated target: subcellular entity
has db xref: NIF_Subcellular:nlx_subcell_100315

intracellular anatomical structure
type: Class
subclass of: cellular anatomical entity
IAO_0000115: A component of a cell contained within (but not including) the plasma membrane. In eukaryotes it includes the nucleus and cytoplasm.
has exact synonym: internal to cell
has exact synonym: intracellular
has exact synonym: protoplasm
has related synonym: nucleocytoplasm
has related synonym: protoplast

Axiom
annotated source: intracellular anatomical structure
annotated property: IAO_0000115
annotated target: A component of a cell contained within (but not including) the plasma membrane. In eukaryotes it includes the nucleus and cytoplasm.
has db xref: ISBN:0198506732

Axiom
annotated source: intracellular anatomical structure
annotated property: hasRelatedSynonym
annotated target: nucleocytoplasm
has db xref: GOC:mah

Axiom
annotated source: intracellular anatomical structure
annotated property: hasRelatedSynonym
annotated target: protoplast
has db xref: GOC:mah

cytoplasm
type: Class
subclass of: cellular anatomical entity
subclass of: Restriction
  on property: BFO_0000050
  some values from: intracellular anatomical structure
IAO_0000115: The contents of a cell excluding the plasma membrane and nucleus, but including other subcellular structures.

Axiom
annotated source: cytoplasm
annotated property: IAO_0000115
annotated target: The contents of a cell excluding the plasma membrane and nucleus, but including other subcellular structures.
has db xref: ISBN:0198547684

plasma membrane
type: Class
subclass of: membrane
subclass of: Restriction
  on property: BFO_0000050
  some values from: cell periphery
IAO_0000115: The membrane surrounding a cell that separates the cell from its external environment. It consists of a phospholipid bilayer and associated proteins.
has broad synonym: juxtamembrane
has exact synonym: cell membrane
has exact synonym: cellular membrane
has exact synonym: cytoplasmic membrane
has exact synonym: plasmalemma
has narrow synonym: bacterial inner membrane
has narrow synonym: inner endospore membrane
has narrow synonym: integral component of plasma membrane
has narrow synonym: integral to plasma membrane
has narrow synonym: plasma membrane lipid bilayer

Axiom
annotated source: plasma membrane
annotated property: IAO_0000115
annotated target: The membrane surrounding a cell that separates the cell from its external environment. It consists of a phospholipid bilayer and associated proteins.
has db xref: ISBN:0716731363

Axiom
annotated source: plasma membrane
annotated property: hasExactSynonym
annotated target: cellular membrane
has db xref: NIF_Subcellular:sao6433132645

Axiom
annotated source: plasma membrane
annotated property: hasNarrowSynonym
annotated target: plasma membrane lipid bilayer
has db xref: GOC:mah

cell cortex
type: Class
equivalent class: Class
  intersection of: cytoplasm
  intersection of: Restriction
    on property: BFO_0000050
    some values from: cell periphery
subclass of: cytoplasm
subclass of: Restriction
  on property: BFO_0000050
  some values from: cell periphery
IAO_0000115: The region of a cell that lies just beneath the plasma membrane and often, but not always, contains a network of actin filaments and associated proteins.
has related synonym: cell periphery
has related synonym: peripheral cytoplasm

Axiom
annotated source: cell cortex
annotated property: IAO_0000115
annotated target: The region of a cell that lies just beneath the plasma membrane and often, but not always, contains a network of actin filaments and associated proteins.
has db xref: GOC:mah
has db xref: ISBN:0815316194

cellular aromatic compound metabolic process
type: Class
subclass of: cellular metabolic process
IAO_0000115: The chemical reactions and pathways involving aromatic compounds, any organic compound characterized by one or more planar rings, each of which contains conjugated double bonds and delocalized pi electrons, as carried out by individual cells.
has exact synonym: aromatic compound metabolism
has narrow synonym: aromatic hydrocarbon metabolic process
has narrow synonym: aromatic hydrocarbon metabolism

Axiom
annotated source: cellular aromatic compound metabolic process
annotated property: IAO_0000115
annotated target: The chemical reactions and pathways involving aromatic compounds, any organic compound characterized by one or more planar rings, each of which contains conjugated double bonds and delocalized pi electrons, as carried out by individual cells.
has db xref: GOC:ai
has db xref: ISBN:0198506732

phosphorus metabolic process
type: Class
subclass of: cellular metabolic process
IAO_0000115: The chemical reactions and pathways involving the nonmetallic element phosphorus or compounds that contain phosphorus, usually in the form of a phosphate group (PO4).
has exact synonym: phosphorus metabolism

Axiom
annotated source: phosphorus metabolic process
annotated property: IAO_0000115
annotated target: The chemical reactions and pathways involving the nonmetallic element phosphorus or compounds that contain phosphorus, usually in the form of a phosphate group (PO4).
has db xref: GOC:ai

phosphate-containing compound metabolic process
type: Class
subclass of: phosphorus metabolic process
IAO_0000115: The chemical reactions and pathways involving the phosphate group, the anion or salt of any phosphoric acid.
has exact synonym: phosphate metabolism
has related synonym: phosphate metabolic process

Axiom
annotated source: phosphate-containing compound metabolic process
annotated property: IAO_0000115
annotated target: The chemical reactions and pathways involving the phosphate group, the anion or salt of any phosphoric acid.
has db xref: GOC:ai

transport
type: Class
subclass of: establishment of localization
IAO_0000115: The directed movement of substances (such as macromolecules, small molecules, ions) or cellular components (such as complexes and organelles) into, out of or within a cell, or between cells, or within a multicellular organism by means of some agent such as a transporter or a transporter complex, a pore or a motor protein.
has related synonym: single-organism transport

Axiom
annotated source: transport
annotated property: IAO_0000115
annotated target: The directed movement of substances (such as macromolecules, small molecules, ions) or cellular components (such as complexes and organelles) into, out of or within a cell, or between cells, or within a multicellular organism by means of some agent such as a transporter or a transporter complex, a pore or a motor protein.
has db xref: GOC:dos
has db xref: GOC:dph
has db xref: GOC:jl
has db xref: GOC:mah

water transport
type: Class
subclass of: fluid transport
subclass of: organic substance transport
IAO_0000115: The directed movement of water (H2O) into, out of or within a cell, or between cells, by means of some agent such as a transporter or pore.

Axiom
annotated source: water transport
annotated property: IAO_0000115
annotated target: The directed movement of water (H2O) into, out of or within a cell, or between cells, by means of some agent such as a transporter or pore.
has db xref: GOC:ai

response to stress
type: Class
subclass of: response to stimulus
IAO_0000115: Any process that results in a change in state or activity of a cell or an organism (in terms of movement, secretion, enzyme production, gene expression, etc.) as a result of a disturbance in organismal or cellular homeostasis, usually, but not necessarily, exogenous (e.g. temperature, humidity, ionizing radiation).
has related synonym: response to abiotic stress
has related synonym: response to biotic stress

Axiom
annotated source: response to stress
annotated property: IAO_0000115
annotated target: Any process that results in a change in state or activity of a cell or an organism (in terms of movement, secretion, enzyme production, gene expression, etc.) as a result of a disturbance in organismal or cellular homeostasis, usually, but not necessarily, exogenous (e.g. temperature, humidity, ionizing radiation).
has db xref: GOC:mah

response to osmotic stress
type: Class
subclass of: response to stress
subclass of: response to abiotic stimulus
IAO_0000115: Any process that results in a change in state or activity of a cell or an organism (in terms of movement, secretion, enzyme production, gene expression, etc.) as a result of a stimulus indicating an increase or decrease in the concentration of solutes outside the organism or cell.
has exact synonym: osmotic response
has exact synonym: osmotic stress response

Axiom
annotated source: response to osmotic stress
annotated property: IAO_0000115
annotated target: Any process that results in a change in state or activity of a cell or an organism (in terms of movement, secretion, enzyme production, gene expression, etc.) as a result of a stimulus indicating an increase or decrease in the concentration of solutes outside the organism or cell.
has db xref: GOC:jl

organelle organization
type: Class
subclass of: cellular component organization
IAO_0000115: A process that is carried out at the cellular level which results in the assembly, arrangement of constituent parts, or disassembly of an organelle within a cell. An organelle is an organized structure of distinctive morphology and function. Includes the nucleus, mitochondria, plastids, vacuoles, vesicles, ribosomes and the cytoskeleton. Excludes the plasma membrane.
has exact synonym: organelle organisation
has exact synonym: single organism organelle organization
has related synonym: organelle organization and biogenesis
has related synonym: single-organism organelle organization

Axiom
annotated source: organelle organization
annotated property: IAO_0000115
annotated target: A process that is carried out at the cellular level which results in the assembly, arrangement of constituent parts, or disassembly of an organelle within a cell. An organelle is an organized structure of distinctive morphology and function. Includes the nucleus, mitochondria, plastids, vacuoles, vesicles, ribosomes and the cytoskeleton. Excludes the plasma membrane.
has db xref: GOC:mah

Axiom
annotated source: organelle organization
annotated property: hasExactSynonym
annotated target: single organism organelle organization
has db xref: GOC:TermGenie

Axiom
annotated source: organelle organization
annotated property: hasRelatedSynonym
annotated target: organelle organization and biogenesis
has db xref: GOC:dph
has db xref: GOC:jl
has db xref: GOC:mah

cell cycle
type: Class
subclass of: cellular process
IAO_0000115: The progression of biochemical and morphological phases and events that occur in a cell during successive cell replication or nuclear replication events. Canonically, the cell cycle comprises the replication and segregation of genetic material followed by the division of the cell, but in endocycles or syncytial cells nuclear replication or nuclear division may not be followed by cell division.
has exact synonym: cell-division cycle

Axiom
annotated source: cell cycle
annotated property: IAO_0000115
annotated target: The progression of biochemical and morphological phases and events that occur in a cell during successive cell replication or nuclear replication events. Canonically, the cell cycle comprises the replication and segregation of genetic material followed by the division of the cell, but in endocycles or syncytial cells nuclear replication or nuclear division may not be followed by cell division.
has db xref: GOC:go_curators
has db xref: GOC:mtg_cell_cycle

regulation of mitotic nuclear division
type: Class
equivalent class: Class
  intersection of: biological regulation
  intersection of: Restriction
    on property: RO_0002211
    some values from: mitotic nuclear division
subclass of: regulation of mitotic cell cycle
subclass of: regulation of cell cycle process
subclass of: regulation of nuclear division
subclass of: Restriction
  on property: RO_0002211
  some values from: mitotic nuclear division
IAO_0000115: Any process that modulates the frequency, rate or extent of mitosis.
has exact synonym: regulation of mitosis

Axiom
annotated source: regulation of mitotic nuclear division
annotated property: IAO_0000115
annotated target: Any process that modulates the frequency, rate or extent of mitosis.
has db xref: GOC:go_curators

cell communication
type: Class
subclass of: cellular process
IAO_0000115: Any process that mediates interactions between a cell and its surroundings. Encompasses interactions such as signaling or attachment between one cell and another cell, between a cell and an extracellular matrix, or between a cell and any other aspect of its environment.

Axiom
annotated source: cell communication
annotated property: IAO_0000115
annotated target: Any process that mediates interactions between a cell and its surroundings. Encompasses interactions such as signaling or attachment between one cell and another cell, between a cell and an extracellular matrix, or between a cell and any other aspect of its environment.
has db xref: GOC:mah

signal transduction
type: Class
subclass of: cellular process
subclass of: regulation of cellular process
subclass of: Restriction
  on property: BFO_0000050
  some values from: cell communication
subclass of: Restriction
  on property: BFO_0000050
  some values from: signaling
subclass of: Restriction
  on property: BFO_0000050
  some values from: cellular response to stimulus
IAO_0000115: The cellular process in which a signal is conveyed to trigger a change in the activity or state of a cell. Signal transduction begins with reception of a signal (e.g. a ligand binding to a receptor or receptor activation by a stimulus such as light), or for signal transduction in the absence of ligand, signal-withdrawal or the activity of a constitutively active receptor. Signal transduction ends with regulation of a downstream cellular process, e.g. regulation of transcription or regulation of a metabolic process. Signal transduction covers signaling from receptors located on the surface of the cell and signaling via molecules located within the cell. For signaling between cells, signal transduction is restricted to events at and within the receiving cell.
has narrow synonym: signal transduction by cis-phosphorylation
has narrow synonym: signal transduction by conformational transition
has narrow synonym: signal transduction by protein phosphorylation
has narrow synonym: signal transduction by trans-phosphorylation
has narrow synonym: signaling cascade
has narrow synonym: signalling cascade
has related synonym: signaling pathway
has related synonym: signalling pathway

Axiom
annotated source: signal transduction
annotated property: IAO_0000115
annotated target: The cellular process in which a signal is conveyed to trigger a change in the activity or state of a cell. Signal transduction begins with reception of a signal (e.g. a ligand binding to a receptor or receptor activation by a stimulus such as light), or for signal transduction in the absence of ligand, signal-withdrawal or the activity of a constitutively active receptor. Signal transduction ends with regulation of a downstream cellular process, e.g. regulation of transcription or regulation of a metabolic process. Signal transduction covers signaling from receptors located on the surface of the cell and signaling via molecules located within the cell. For signaling between cells, signal transduction is restricted to events at and within the receiving cell.
has db xref: GOC:go_curators
has db xref: GOC:mtg_signaling_feb11

Axiom
annotated source: signal transduction
annotated property: hasRelatedSynonym
annotated target: signalling pathway
has db xref: GOC:mah

multicellular organism development
type: Class
subclass of: multicellular organismal process
subclass of: anatomical structure development
IAO_0000115: The biological process whose specific outcome is the progression of a multicellular organism over time from an initial condition (e.g. a zygote or a young adult) to a later condition (e.g. a multicellular animal or an aged adult).

Axiom
annotated source: multicellular organism development
annotated property: IAO_0000115
annotated target: The biological process whose specific outcome is the progression of a multicellular organism over time from an initial condition (e.g. a zygote or a young adult) to a later condition (e.g. a multicellular animal or an aged adult).
has db xref: GOC:dph
has db xref: GOC:ems
has db xref: GOC:isa_complete
has db xref: GOC:tb

regulation of mitotic cell cycle
type: Class
equivalent class: Class
  intersection of: biological regulation
  intersection of: Restriction
    on property: RO_0002211
    some values from: mitotic cell cycle
subclass of: regulation of cell cycle
subclass of: Restriction
  on property: RO_0002211
  some values from: mitotic cell cycle
IAO_0000115: Any process that modulates the rate or extent of progress through the mitotic cell cycle.
has exact synonym: mitotic cell cycle modulation
has exact synonym: mitotic cell cycle regulation
has exact synonym: modulation of mitotic cell cycle progression
has exact synonym: regulation of mitotic cell cycle progression
has exact synonym: regulation of progression through mitotic cell cycle
has related synonym: mitotic cell cycle regulator

Axiom
annotated source: regulation of mitotic cell cycle
annotated property: IAO_0000115
annotated target: Any process that modulates the rate or extent of progress through the mitotic cell cycle.
has db xref: GOC:dph
has db xref: GOC:go_curators
has db xref: GOC:tb

Axiom
annotated source: regulation of mitotic cell cycle
annotated property: hasExactSynonym
annotated target: regulation of progression through mitotic cell cycle
has db xref: GOC:dph
has db xref: GOC:tb

respiratory gaseous exchange by respiratory system
type: Class
subclass of: multicellular organismal process
IAO_0000115: The process of gaseous exchange between an organism and its environment. In plants, microorganisms, and many small animals, air or water makes direct contact with the organism's cells or tissue fluids, and the processes of diffusion supply the organism with dioxygen (O2) and remove carbon dioxide (CO2). In larger animals the efficiency of gaseous exchange is improved by specialized respiratory organs, such as lungs and gills, which are ventilated by breathing mechanisms.
has broad synonym: breathing
has broad synonym: respiration

Axiom
annotated source: respiratory gaseous exchange by respiratory system
annotated property: IAO_0000115
annotated target: The process of gaseous exchange between an organism and its environment. In plants, microorganisms, and many small animals, air or water makes direct contact with the organism's cells or tissue fluids, and the processes of diffusion supply the organism with dioxygen (O2) and remove carbon dioxide (CO2). In larger animals the efficiency of gaseous exchange is improved by specialized respiratory organs, such as lungs and gills, which are ventilated by breathing mechanisms.
has db xref: ISBN:0198506732

biological_process
type: Class
IAO_0000115: A biological process is the execution of a genetically-encoded biological module or program. It consists of all the steps required to achieve the specific biological objective of the module. A biological process is accomplished by a particular set of molecular functions carried out by specific gene products (or macromolecular complexes), often in a highly regulated manner and in a particular temporal sequence.
has exact synonym: biological process
has exact synonym: physiological process
has related synonym: single organism process
has related synonym: single-organism process

Axiom
annotated source: biological_process
annotated property: IAO_0000115
annotated target: A biological process is the execution of a genetically-encoded biological module or program. It consists of all the steps required to achieve the specific biological objective of the module. A biological process is accomplished by a particular set of molecular functions carried out by specific gene products (or macromolecular complexes), often in a highly regulated manner and in a particular temporal sequence.
has db xref: GOC:pdt

metabolic process
type: Class
subclass of: biological_process
disjoint with: localization
IAO_0000115: The chemical reactions and pathways, including anabolism and catabolism, by which living organisms transform chemical substances. Metabolic processes typically transform small molecules, but also include macromolecular processes such as DNA repair and replication, and protein synthesis and degradation.
has exact synonym: metabolism
has narrow synonym: metabolic process resulting in cell growth
has narrow synonym: metabolism resulting in cell growth
has narrow synonym: multicellular organism metabolic process
has related synonym: single-organism metabolic process

Axiom
annotated source: metabolic process
annotated property: IAO_0000115
annotated target: The chemical reactions and pathways, including anabolism and catabolism, by which living organisms transform chemical substances. Metabolic processes typically transform small molecules, but also include macromolecular processes such as DNA repair and replication, and protein synthesis and degradation.
has db xref: GOC:go_curators
has db xref: ISBN:0198547684

UDP-glycosyltransferase activity
type: Class
subclass of: glycosyltransferase activity
IAO_0000115: Catalysis of the transfer of a glycosyl group from a UDP-sugar to a small hydrophobic molecule.

Axiom
annotated source: UDP-glycosyltransferase activity
annotated property: IAO_0000115
annotated target: Catalysis of the transfer of a glycosyl group from a UDP-sugar to a small hydrophobic molecule.
has db xref: InterPro:IPR004224
has db xref: PMID:11846783

glucose-1-phosphate adenylyltransferase activity
type: Class
subclass of: adenylyltransferase activity
IAO_0000115: Catalysis of the reaction: alpha-D-glucose 1-phosphate + ATP = ADP-glucose + diphosphate.
has exact synonym: ADGase activity
has exact synonym: ADPG pyrophosphorylase activity
has exact synonym: ATP:alpha-glucose-1-phosphate adenylyl transferase activity
has related synonym: ADP glucose pyrophosphorylase activity
has related synonym: ADP-glucose diphosphorylase activity
has related synonym: ADP-glucose pyrophosphorylase activity
has related synonym: ADP-glucose synthase activity
has related synonym: ADP-glucose synthetase activity
has related synonym: ADP:alpha-D-glucose-1-phosphate adenylyltransferase activity
has related synonym: ATP:alpha-D-glucose-1-phosphate adenylyltransferase activity
has related synonym: adenosine diphosphate glucose pyrophosphorylase activity
has related synonym: adenosine diphosphoglucose pyrophosphorylase activity
has related synonym: glucose 1-phosphate adenylyltransferase activity

Axiom
annotated source: glucose-1-phosphate adenylyltransferase activity
annotated property: IAO_0000115
annotated target: Catalysis of the reaction: alpha-D-glucose 1-phosphate + ATP = ADP-glucose + diphosphate.
has db xref: EC:2.7.7.27
has db xref: RHEA:12120

Axiom
annotated source: glucose-1-phosphate adenylyltransferase activity
annotated property: hasRelatedSynonym
annotated target: ADP glucose pyrophosphorylase activity
has db xref: EC:2.7.7.27

Axiom
annotated source: glucose-1-phosphate adenylyltransferase activity
annotated property: hasRelatedSynonym
annotated target: ADP-glucose diphosphorylase activity
has db xref: EC:2.7.7.27

Axiom
annotated source: glucose-1-phosphate adenylyltransferase activity
annotated property: hasRelatedSynonym
annotated target: ADP-glucose pyrophosphorylase activity
has db xref: EC:2.7.7.27

Axiom
annotated source: glucose-1-phosphate adenylyltransferase activity
annotated property: hasRelatedSynonym
annotated target: ADP-glucose synthase activity
has db xref: EC:2.7.7.27

Axiom
annotated source: glucose-1-phosphate adenylyltransferase activity
annotated property: hasRelatedSynonym
annotated target: ADP-glucose synthetase activity
has db xref: EC:2.7.7.27

Axiom
annotated source: glucose-1-phosphate adenylyltransferase activity
annotated property: hasRelatedSynonym
annotated target: ADP:alpha-D-glucose-1-phosphate adenylyltransferase activity
has db xref: EC:2.7.7.27

Axiom
annotated source: glucose-1-phosphate adenylyltransferase activity
annotated property: hasRelatedSynonym
annotated target: ATP:alpha-D-glucose-1-phosphate adenylyltransferase activity
has db xref: EC:2.7.7.27

Axiom
annotated source: glucose-1-phosphate adenylyltransferase activity
annotated property: hasRelatedSynonym
annotated target: adenosine diphosphate glucose pyrophosphorylase activity
has db xref: EC:2.7.7.27

Axiom
annotated source: glucose-1-phosphate adenylyltransferase activity
annotated property: hasRelatedSynonym
annotated target: adenosine diphosphoglucose pyrophosphorylase activity
has db xref: EC:2.7.7.27

Axiom
annotated source: glucose-1-phosphate adenylyltransferase activity
annotated property: hasRelatedSynonym
annotated target: glucose 1-phosphate adenylyltransferase activity
has db xref: EC:2.7.7.27

biosynthetic process
type: Class
subclass of: metabolic process
IAO_0000115: The chemical reactions and pathways resulting in the formation of substances; typically the energy-requiring part of metabolism in which simpler substances are transformed into more complex ones.
has broad synonym: formation
has exact synonym: anabolism
has exact synonym: biosynthesis
has exact synonym: synthesis
has narrow synonym: multicellular organismal biosynthetic process
has related synonym: single-organism biosynthetic process

Axiom
annotated source: biosynthetic process
annotated property: IAO_0000115
annotated target: The chemical reactions and pathways resulting in the formation of substances; typically the energy-requiring part of metabolism in which simpler substances are transformed into more complex ones.
has db xref: GOC:curators
has db xref: ISBN:0198547684

plastid envelope
type: Class
subclass of: organelle envelope
subclass of: Restriction
  on property: BFO_0000050
  some values from: plastid
IAO_0000115: The double lipid bilayer enclosing a plastid and separating its contents from the rest of the cytoplasm; includes the intermembrane space.

Axiom
annotated source: plastid envelope
annotated property: IAO_0000115
annotated target: The double lipid bilayer enclosing a plastid and separating its contents from the rest of the cytoplasm; includes the intermembrane space.
has db xref: GOC:jy

plastid
type: Class
subclass of: intracellular membrane-bounded organelle
subclass of: Restriction
  on property: BFO_0000050
  some values from: cytoplasm
IAO_0000115: Any member of a family of organelles found in the cytoplasm of plants and some protists, which are membrane-bounded and contain DNA. Plant plastids develop from a common type, the proplastid.

Axiom
annotated source: plastid
annotated property: IAO_0000115
annotated target: Any member of a family of organelles found in the cytoplasm of plants and some protists, which are membrane-bounded and contain DNA. Plant plastids develop from a common type, the proplastid.
has db xref: GOC:jl
has db xref: ISBN:0198547684

response to abiotic stimulus
type: Class
subclass of: response to stimulus
IAO_0000115: Any process that results in a change in state or activity of a cell or an organism (in terms of movement, secretion, enzyme production, gene expression, etc.) as a result of an abiotic (not derived from living organisms) stimulus.
has narrow synonym: response to abiotic stress

Axiom
annotated source: response to abiotic stimulus
annotated property: IAO_0000115
annotated target: Any process that results in a change in state or activity of a cell or an organism (in terms of movement, secretion, enzyme production, gene expression, etc.) as a result of an abiotic (not derived from living organisms) stimulus.
has db xref: GOC:hb

phenylpropanoid metabolic process
type: Class
subclass of: cellular aromatic compound metabolic process
subclass of: secondary metabolic process
subclass of: organic cyclic compound metabolic process
IAO_0000115: The chemical reactions and pathways involving aromatic derivatives of trans-cinnamic acid.
has exact synonym: phenylpropanoid metabolism

Axiom
annotated source: phenylpropanoid metabolic process
annotated property: IAO_0000115
annotated target: The chemical reactions and pathways involving aromatic derivatives of trans-cinnamic acid.
has db xref: GOC:jl

phenylpropanoid biosynthetic process
type: Class
subclass of: phenylpropanoid metabolic process
subclass of: aromatic compound biosynthetic process
subclass of: secondary metabolite biosynthetic process
subclass of: organic cyclic compound biosynthetic process
IAO_0000115: The chemical reactions and pathways resulting in the formation of aromatic derivatives of trans-cinnamic acid.
has exact synonym: phenylpropanoid anabolism
has exact synonym: phenylpropanoid biosynthesis
has exact synonym: phenylpropanoid formation
has exact synonym: phenylpropanoid synthesis

Axiom
annotated source: phenylpropanoid biosynthetic process
annotated property: IAO_0000115
annotated target: The chemical reactions and pathways resulting in the formation of aromatic derivatives of trans-cinnamic acid.
has db xref: GOC:jl

post-embryonic development
type: Class
subclass of: multicellular organismal process
subclass of: Restriction
  on property: BFO_0000050
  some values from: multicellular organism development
IAO_0000115: The process whose specific outcome is the progression of the organism over time, from the completion of embryonic development to the mature structure. See embryonic development.

Axiom
annotated source: post-embryonic development
annotated property: IAO_0000115
annotated target: The process whose specific outcome is the progression of the organism over time, from the completion of embryonic development to the mature structure. See embryonic development.
has db xref: GOC:go_curators

lignin metabolic process
type: Class
subclass of: phenylpropanoid metabolic process
IAO_0000115: The chemical reactions and pathways involving lignins, a class of polymers of phenylpropanoid units.
has exact synonym: lignin metabolism

Axiom
annotated source: lignin metabolic process
annotated property: IAO_0000115
annotated target: The chemical reactions and pathways involving lignins, a class of polymers of phenylpropanoid units.
has db xref: GOC:lr
has db xref: GOC:yl

lignin biosynthetic process
type: Class
subclass of: phenylpropanoid biosynthetic process
subclass of: lignin metabolic process
IAO_0000115: The chemical reactions and pathways resulting in the formation of lignins, a class of polymers formed by the dehydrogenetive radical polymerization of various phenylpropanoid monomers.
has exact synonym: lignin anabolism
has exact synonym: lignin biosynthesis
has exact synonym: lignin formation
has exact synonym: lignin synthesis

Axiom
annotated source: lignin biosynthetic process
annotated property: IAO_0000115
annotated target: The chemical reactions and pathways resulting in the formation of lignins, a class of polymers formed by the dehydrogenetive radical polymerization of various phenylpropanoid monomers.
has db xref: GOC:tair_curators
has db xref: ISBN:0198547684

fruit ripening
type: Class
subclass of: developmental process involved in reproduction
subclass of: anatomical structure maturation
subclass of: Restriction
  on property: BFO_0000050
  some values from: fruit development
IAO_0000115: An developmental maturation process that has as participant a fruit. Ripening causes changes in one or more characteristics of a fruit (color, aroma, flavor, texture, hardness, cell wall structure) and may make it more attractive to animals and aid in seed dispersal.
has related synonym: fruit maturation
has related synonym: fruit senescence

Axiom
annotated source: fruit ripening
annotated property: IAO_0000115
annotated target: An developmental maturation process that has as participant a fruit. Ripening causes changes in one or more characteristics of a fruit (color, aroma, flavor, texture, hardness, cell wall structure) and may make it more attractive to animals and aid in seed dispersal.
has db xref: GOC:lr

Axiom
annotated source: fruit ripening
annotated property: hasRelatedSynonym
annotated target: fruit maturation
has db xref: GOC:PO_curators

Axiom
annotated source: fruit ripening
annotated property: hasRelatedSynonym
annotated target: fruit senescence
has db xref: GOC:PO_curators

tissue development
type: Class
subclass of: anatomical structure development
IAO_0000115: The process whose specific outcome is the progression of a tissue over time, from its formation to the mature structure.
has broad synonym: histogenesis and organogenesis
has exact synonym: histogenesis

Axiom
annotated source: tissue development
annotated property: IAO_0000115
annotated target: The process whose specific outcome is the progression of a tissue over time, from its formation to the mature structure.
has db xref: ISBN:0471245208

regulation of biosynthetic process
type: Class
equivalent class: Class
  intersection of: biological regulation
  intersection of: Restriction
    on property: RO_0002211
    some values from: biosynthetic process
subclass of: regulation of metabolic process
subclass of: Restriction
  on property: RO_0002211
  some values from: biosynthetic process
IAO_0000115: Any process that modulates the frequency, rate or extent of the chemical reactions and pathways resulting in the formation of substances.
has exact synonym: regulation of anabolism
has exact synonym: regulation of biosynthesis
has exact synonym: regulation of formation
has exact synonym: regulation of synthesis

Axiom
annotated source: regulation of biosynthetic process
annotated property: IAO_0000115
annotated target: Any process that modulates the frequency, rate or extent of the chemical reactions and pathways resulting in the formation of substances.
has db xref: GOC:go_curators

positive regulation of biosynthetic process
type: Class
equivalent class: Class
  intersection of: biological regulation
  intersection of: Restriction
    on property: RO_0002213
    some values from: biosynthetic process
subclass of: regulation of biosynthetic process
subclass of: positive regulation of metabolic process
subclass of: Restriction
  on property: RO_0002213
  some values from: biosynthetic process
IAO_0000115: Any process that activates or increases the frequency, rate or extent of the chemical reactions and pathways resulting in the formation of substances.
has exact synonym: positive regulation of anabolism
has exact synonym: positive regulation of biosynthesis
has exact synonym: positive regulation of formation
has exact synonym: positive regulation of synthesis
has exact synonym: up regulation of biosynthetic process
has exact synonym: up-regulation of biosynthetic process
has exact synonym: upregulation of biosynthetic process
has narrow synonym: activation of biosynthetic process
has narrow synonym: stimulation of biosynthetic process

Axiom
annotated source: positive regulation of biosynthetic process
annotated property: IAO_0000115
annotated target: Any process that activates or increases the frequency, rate or extent of the chemical reactions and pathways resulting in the formation of substances.
has db xref: GOC:go_curators

positive regulation of metabolic process
type: Class
equivalent class: Class
  intersection of: biological regulation
  intersection of: Restriction
    on property: RO_0002213
    some values from: metabolic process
subclass of: regulation of metabolic process
subclass of: positive regulation of biological process
subclass of: Restriction
  on property: RO_0002213
  some values from: metabolic process
IAO_0000115: Any process that activates or increases the frequency, rate or extent of the chemical reactions and pathways within a cell or an organism.
has exact synonym: positive regulation of metabolism
has exact synonym: up regulation of metabolic process
has exact synonym: up-regulation of metabolic process
has exact synonym: upregulation of metabolic process
has narrow synonym: activation of metabolic process
has narrow synonym: positive regulation of multicellular organismal metabolic process
has narrow synonym: positive regulation of organismal metabolism
has narrow synonym: stimulation of metabolic process
has narrow synonym: stimulation of organismal metabolic process
has narrow synonym: up-regulation of organismal metabolic process

Axiom
annotated source: positive regulation of metabolic process
annotated property: IAO_0000115
annotated target: Any process that activates or increases the frequency, rate or extent of the chemical reactions and pathways within a cell or an organism.
has db xref: GOC:go_curators

flower development
type: Class
subclass of: reproductive shoot system development
IAO_0000115: The process whose specific outcome is the progression of the flower over time, from its formation to the mature structure. The flower is the reproductive structure in a plant, and its development begins with the transition of the vegetative or inflorescence meristem into a floral meristem.

Axiom
annotated source: flower development
annotated property: IAO_0000115
annotated target: The process whose specific outcome is the progression of the flower over time, from its formation to the mature structure. The flower is the reproductive structure in a plant, and its development begins with the transition of the vegetative or inflorescence meristem into a floral meristem.
has db xref: GOC:tb
has db xref: ISBN:0879015322

regulation of flower development
type: Class
equivalent class: Class
  intersection of: biological regulation
  intersection of: Restriction
    on property: RO_0002211
    some values from: flower development
subclass of: regulation of post-embryonic development
subclass of: regulation of shoot system development
subclass of: regulation of reproductive process
subclass of: Restriction
  on property: RO_0002211
  some values from: flower development
IAO_0000115: Any process that modulates the frequency, rate or extent of flower development.

Axiom
annotated source: regulation of flower development
annotated property: IAO_0000115
annotated target: Any process that modulates the frequency, rate or extent of flower development.
has db xref: GOC:go_curators

positive regulation of flower development
type: Class
equivalent class: Class
  intersection of: biological regulation
  intersection of: Restriction
    on property: RO_0002213
    some values from: flower development
subclass of: regulation of flower development
subclass of: positive regulation of post-embryonic development
subclass of: positive regulation of reproductive process
subclass of: Restriction
  on property: RO_0002213
  some values from: flower development
IAO_0000115: Any process that activates or increases the frequency, rate or extent of flower development.
has exact synonym: up regulation of flower development
has exact synonym: up-regulation of flower development
has exact synonym: upregulation of flower development
has narrow synonym: activation of flower development
has narrow synonym: stimulation of flower development

Axiom
annotated source: positive regulation of flower development
annotated property: IAO_0000115
annotated target: Any process that activates or increases the frequency, rate or extent of flower development.
has db xref: GOC:go_curators

regulation of signal transduction
type: Class
equivalent class: Class
  intersection of: biological regulation
  intersection of: Restriction
    on property: RO_0002211
    some values from: signal transduction
subclass of: regulation of cell communication
subclass of: regulation of signaling
subclass of: regulation of response to stimulus
subclass of: Restriction
  on property: RO_0002211
  some values from: signal transduction
IAO_0000115: Any process that modulates the frequency, rate or extent of signal transduction.
has related synonym: regulation of signaling pathway
has related synonym: regulation of signalling pathway

Axiom
annotated source: regulation of signal transduction
annotated property: IAO_0000115
annotated target: Any process that modulates the frequency, rate or extent of signal transduction.
has db xref: GOC:sm

Axiom
annotated source: regulation of signal transduction
annotated property: hasRelatedSynonym
annotated target: regulation of signalling pathway
has db xref: GOC:mah

positive regulation of signal transduction
type: Class
equivalent class: Class
  intersection of: biological regulation
  intersection of: Restriction
    on property: RO_0002213
    some values from: signal transduction
subclass of: regulation of signal transduction
subclass of: positive regulation of cell communication
subclass of: positive regulation of signaling
subclass of: positive regulation of response to stimulus
subclass of: Restriction
  on property: RO_0002213
  some values from: signal transduction
IAO_0000115: Any process that activates or increases the frequency, rate or extent of signal transduction.
has exact synonym: up regulation of signal transduction
has exact synonym: up-regulation of signal transduction
has exact synonym: upregulation of signal transduction
has narrow synonym: activation of signal transduction
has narrow synonym: stimulation of signal transduction
has related synonym: positive regulation of signaling pathway
has related synonym: positive regulation of signalling pathway

Axiom
annotated source: positive regulation of signal transduction
annotated property: IAO_0000115
annotated target: Any process that activates or increases the frequency, rate or extent of signal transduction.
has db xref: GOC:sm

Axiom
annotated source: positive regulation of signal transduction
annotated property: hasRelatedSynonym
annotated target: positive regulation of signalling pathway
has db xref: GOC:mah

cellular process
type: Class
subclass of: biological_process
IAO_0000115: Any process that is carried out at the cellular level, but not necessarily restricted to a single cell. For example, cell communication occurs among more than one cell, but occurs at the cellular level.
has exact synonym: cell physiology
has exact synonym: cellular physiological process
has narrow synonym: cell growth and/or maintenance
has related synonym: single-organism cellular process

Axiom
annotated source: cellular process
annotated property: IAO_0000115
annotated target: Any process that is carried out at the cellular level, but not necessarily restricted to a single cell. For example, cell communication occurs among more than one cell, but occurs at the cellular level.
has db xref: GOC:go_curators
has db xref: GOC:isa_complete

stomatal movement
type: Class
subclass of: cellular process
IAO_0000115: The process of opening or closing of stomata, which is directly related to the stomatal conductance (measuring rate of passage of either water vapor or carbon dioxide (CO2) through stomata).

Axiom
annotated source: stomatal movement
annotated property: IAO_0000115
annotated target: The process of opening or closing of stomata, which is directly related to the stomatal conductance (measuring rate of passage of either water vapor or carbon dioxide (CO2) through stomata).
has db xref: GOC:sm

regulation of stomatal movement
type: Class
equivalent class: Class
  intersection of: biological regulation
  intersection of: Restriction
    on property: RO_0002211
    some values from: stomatal movement
subclass of: regulation of cellular process
subclass of: Restriction
  on property: RO_0002211
  some values from: stomatal movement
IAO_0000115: Any process that modulates the frequency, rate or extent of stomatal movement.

Axiom
annotated source: regulation of stomatal movement
annotated property: IAO_0000115
annotated target: Any process that modulates the frequency, rate or extent of stomatal movement.
has db xref: GOC:sm

transpiration
type: Class
subclass of: water transport
IAO_0000115: Release of water by the plant into the air as water vapor mainly through leaves.

Axiom
annotated source: transpiration
annotated property: IAO_0000115
annotated target: Release of water by the plant into the air as water vapor mainly through leaves.
has db xref: GOC:sm
has db xref: ISBN:0879015322

leaf senescence
type: Class
subclass of: plant organ senescence
subclass of: Restriction
  on property: BFO_0000050
  some values from: leaf development
IAO_0000115: The last stage of leaf development during which programmed degradation of macromolecules and nutrient recycling take place.

Axiom
annotated source: leaf senescence
annotated property: IAO_0000115
annotated target: The last stage of leaf development during which programmed degradation of macromolecules and nutrient recycling take place.
has db xref: ISBN:0387987819
has db xref: PMID:17177638
has db xref: PMID:34938309

fruit development
type: Class
subclass of: reproductive structure development
IAO_0000115: The process whose specific outcome is the progression of the fruit over time, from its formation to the mature structure. The fruit is a reproductive body of a seed plant.

Axiom
annotated source: fruit development
annotated property: IAO_0000115
annotated target: The process whose specific outcome is the progression of the fruit over time, from its formation to the mature structure. The fruit is a reproductive body of a seed plant.
has db xref: GOC:sm

inflorescence development
type: Class
subclass of: reproductive shoot system development
IAO_0000115: The process whose specific outcome is the progression of an inflorescence over time, from its formation to the mature structure.

Axiom
annotated source: inflorescence development
annotated property: IAO_0000115
annotated target: The process whose specific outcome is the progression of an inflorescence over time, from its formation to the mature structure.
has db xref: GOC:tb

regulation of signaling receptor activity
type: Class
equivalent class: Class
  intersection of: biological regulation
  intersection of: Restriction
    on property: RO_0002211
    some values from: signaling receptor activity
subclass of: regulation of signal transduction
subclass of: regulation of molecular function
subclass of: Restriction
  on property: RO_0002211
  some values from: signaling receptor activity
IAO_0000115: Any process that modulates the frequency, rate or extent of a signaling receptor activity. Receptor activity is when a molecule combines with an extracellular or intracellular messenger to initiate a change in cell activity.
has broad synonym: regulation of receptor activity
has exact synonym: regulation of signalling receptor activity

Axiom
annotated source: regulation of signaling receptor activity
annotated property: IAO_0000115
annotated target: Any process that modulates the frequency, rate or extent of a signaling receptor activity. Receptor activity is when a molecule combines with an extracellular or intracellular messenger to initiate a change in cell activity.
has db xref: GOC:dph
has db xref: GOC:tb

positive regulation of phosphorus metabolic process
type: Class
equivalent class: Class
  intersection of: biological regulation
  intersection of: Restriction
    on property: RO_0002213
    some values from: phosphorus metabolic process
subclass of: positive regulation of cellular metabolic process
subclass of: regulation of phosphorus metabolic process
subclass of: Restriction
  on property: RO_0002213
  some values from: phosphorus metabolic process
IAO_0000115: Any process that increases the frequency, rate or extent of the chemical reactions and pathways involving phosphorus or compounds containing phosphorus.

Axiom
annotated source: positive regulation of phosphorus metabolic process
annotated property: IAO_0000115
annotated target: Any process that increases the frequency, rate or extent of the chemical reactions and pathways involving phosphorus or compounds containing phosphorus.
has db xref: GOC:dph
has db xref: GOC:tb

regulation of cell cycle process
type: Class
equivalent class: Class
  intersection of: biological regulation
  intersection of: Restriction
    on property: RO_0002211
    some values from: cell cycle process
subclass of: regulation of cell cycle
subclass of: Restriction
  on property: RO_0002211
  some values from: cell cycle process
IAO_0000115: Any process that modulates a cellular process that is involved in the progression of biochemical and morphological phases and events that occur in a cell during successive cell replication or nuclear replication events.

Axiom
annotated source: regulation of cell cycle process
annotated property: IAO_0000115
annotated target: Any process that modulates a cellular process that is involved in the progression of biochemical and morphological phases and events that occur in a cell during successive cell replication or nuclear replication events.
has db xref: GOC:dph
has db xref: GOC:tb

positive regulation of organelle organization
type: Class
equivalent class: Class
  intersection of: biological regulation
  intersection of: Restriction
    on property: RO_0002213
    some values from: organelle organization
subclass of: regulation of organelle organization
subclass of: positive regulation of cellular component organization
subclass of: Restriction
  on property: RO_0002213
  some values from: organelle organization
IAO_0000115: Any process that increases the frequency, rate or extent of a process involved in the formation, arrangement of constituent parts, or disassembly of an organelle.
has exact synonym: positive regulation of organelle organisation
has related synonym: positive regulation of organelle organization and biogenesis

Axiom
annotated source: positive regulation of organelle organization
annotated property: IAO_0000115
annotated target: Any process that increases the frequency, rate or extent of a process involved in the formation, arrangement of constituent parts, or disassembly of an organelle.
has db xref: GOC:dph
has db xref: GOC:tb

Axiom
annotated source: positive regulation of organelle organization
annotated property: hasExactSynonym
annotated target: positive regulation of organelle organisation
has db xref: GOC:mah

Axiom
annotated source: positive regulation of organelle organization
annotated property: hasRelatedSynonym
annotated target: positive regulation of organelle organization and biogenesis
has db xref: GOC:mah

regulation of cell communication
type: Class
equivalent class: Class
  intersection of: biological regulation
  intersection of: Restriction
    on property: RO_0002211
    some values from: cell communication
subclass of: regulation of cellular process
subclass of: Restriction
  on property: RO_0002211
  some values from: cell communication
IAO_0000115: Any process that modulates the frequency, rate or extent of cell communication. Cell communication is the process that mediates interactions between a cell and its surroundings. Encompasses interactions such as signaling or attachment between one cell and another cell, between a cell and an extracellular matrix, or between a cell and any other aspect of its environment.

Axiom
annotated source: regulation of cell communication
annotated property: IAO_0000115
annotated target: Any process that modulates the frequency, rate or extent of cell communication. Cell communication is the process that mediates interactions between a cell and its surroundings. Encompasses interactions such as signaling or attachment between one cell and another cell, between a cell and an extracellular matrix, or between a cell and any other aspect of its environment.
has db xref: GOC:dph
has db xref: GOC:tb

positive regulation of cell communication
type: Class
equivalent class: Class
  intersection of: biological regulation
  intersection of: Restriction
    on property: RO_0002213
    some values from: cell communication
subclass of: regulation of cell communication
subclass of: positive regulation of cellular process
subclass of: Restriction
  on property: RO_0002213
  some values from: cell communication
IAO_0000115: Any process that increases the frequency, rate or extent of cell communication. Cell communication is the process that mediates interactions between a cell and its surroundings. Encompasses interactions such as signaling or attachment between one cell and another cell, between a cell and an extracellular matrix, or between a cell and any other aspect of its environment.

Axiom
annotated source: positive regulation of cell communication
annotated property: IAO_0000115
annotated target: Any process that increases the frequency, rate or extent of cell communication. Cell communication is the process that mediates interactions between a cell and its surroundings. Encompasses interactions such as signaling or attachment between one cell and another cell, between a cell and an extracellular matrix, or between a cell and any other aspect of its environment.
has db xref: GOC:dph
has db xref: GOC:tb

regulation of phosphatase activity
type: Class
equivalent class: Class
  intersection of: biological regulation
  intersection of: Restriction
    on property: RO_0002211
    some values from: phosphatase activity
subclass of: regulation of dephosphorylation
subclass of: regulation of hydrolase activity
subclass of: Restriction
  on property: RO_0002211
  some values from: phosphatase activity
IAO_0000115: Any process that modulates the rate or frequency of phosphatase activity. Phosphatases catalyze the hydrolysis of phosphoric monoesters, releasing inorganic phosphate.

Axiom
annotated source: regulation of phosphatase activity
annotated property: IAO_0000115
annotated target: Any process that modulates the rate or frequency of phosphatase activity. Phosphatases catalyze the hydrolysis of phosphoric monoesters, releasing inorganic phosphate.
has db xref: GOC:BHF
has db xref: GOC:dph
has db xref: GOC:tb

positive regulation of phosphatase activity
type: Class
equivalent class: Class
  intersection of: biological regulation
  intersection of: Restriction
    on property: RO_0002213
    some values from: phosphatase activity
subclass of: regulation of phosphatase activity
subclass of: positive regulation of dephosphorylation
subclass of: positive regulation of hydrolase activity
subclass of: Restriction
  on property: RO_0002213
  some values from: phosphatase activity
IAO_0000115: Any process that increases the rate or frequency of phosphatase activity. Phosphatases catalyze the hydrolysis of phosphoric monoesters, releasing inorganic phosphate.

Axiom
annotated source: positive regulation of phosphatase activity
annotated property: IAO_0000115
annotated target: Any process that increases the rate or frequency of phosphatase activity. Phosphatases catalyze the hydrolysis of phosphoric monoesters, releasing inorganic phosphate.
has db xref: GOC:BHF
has db xref: GOC:dph
has db xref: GOC:tb

membrane
type: Class
subclass of: cellular anatomical entity
IAO_0000115: A lipid bilayer along with all the proteins and protein complexes embedded in it and attached to it.
has narrow synonym: integral component of membrane
has narrow synonym: integral to membrane
has narrow synonym: membrane region
has narrow synonym: region of membrane
has narrow synonym: whole membrane
has related synonym: transmembrane

Axiom
annotated source: membrane
annotated property: IAO_0000115
annotated target: A lipid bilayer along with all the proteins and protein complexes embedded in it and attached to it.
has db xref: GOC:dos
has db xref: GOC:mah
has db xref: ISBN:0815316194

Axiom
annotated source: membrane
annotated property: hasRelatedSynonym
annotated target: transmembrane
has db xref: GOC:mah

cellular component organization
type: Class
subclass of: cellular component organization or biogenesis
IAO_0000115: A process that results in the assembly, arrangement of constituent parts, or disassembly of a cellular component.
has exact synonym: cell organisation
has exact synonym: cellular component organisation at cellular level
has exact synonym: cellular component organisation in other organism
has exact synonym: cellular component organization at cellular level
has exact synonym: cellular component organization in other organism
has related synonym: cell organization and biogenesis

Axiom
annotated source: cellular component organization
annotated property: IAO_0000115
annotated target: A process that results in the assembly, arrangement of constituent parts, or disassembly of a cellular component.
has db xref: GOC:ai
has db xref: GOC:jl
has db xref: GOC:mah

Axiom
annotated source: cellular component organization
annotated property: hasExactSynonym
annotated target: cellular component organisation at cellular level
has db xref: GOC:mah

Axiom
annotated source: cellular component organization
annotated property: hasExactSynonym
annotated target: cellular component organisation in other organism
has db xref: GOC:mah

Axiom
annotated source: cellular component organization
annotated property: hasRelatedSynonym
annotated target: cell organization and biogenesis
has db xref: GOC:mah

sucrose synthase activity
type: Class
subclass of: UDP-glucosyltransferase activity
IAO_0000115: Catalysis of the reaction: UDP-glucose + D-fructose = UDP + sucrose.
has related synonym: NDP-glucose:D-fructose 2-alpha-D-glucosyltransferase activity
has related synonym: UDP-glucose-fructose glucosyltransferase activity
has related synonym: UDPglucose-fructose glucosyltransferase activity
has related synonym: sucrose synthetase activity
has related synonym: sucrose-UDP glucosyltransferase activity
has related synonym: sucrose-uridine diphosphate glucosyltransferase activity
has related synonym: uridine diphosphoglucose-fructose glucosyltransferase activity

Axiom
annotated source: sucrose synthase activity
annotated property: IAO_0000115
annotated target: Catalysis of the reaction: UDP-glucose + D-fructose = UDP + sucrose.
has db xref: EC:2.4.1.13

Axiom
annotated source: sucrose synthase activity
annotated property: hasRelatedSynonym
annotated target: NDP-glucose:D-fructose 2-alpha-D-glucosyltransferase activity
has db xref: EC:2.4.1.13

Axiom
annotated source: sucrose synthase activity
annotated property: hasRelatedSynonym
annotated target: UDP-glucose-fructose glucosyltransferase activity
has db xref: EC:2.4.1.13

Axiom
annotated source: sucrose synthase activity
annotated property: hasRelatedSynonym
annotated target: UDPglucose-fructose glucosyltransferase activity
has db xref: EC:2.4.1.13

Axiom
annotated source: sucrose synthase activity
annotated property: hasRelatedSynonym
annotated target: sucrose synthetase activity
has db xref: EC:2.4.1.13

Axiom
annotated source: sucrose synthase activity
annotated property: hasRelatedSynonym
annotated target: sucrose-UDP glucosyltransferase activity
has db xref: EC:2.4.1.13

Axiom
annotated source: sucrose synthase activity
annotated property: hasRelatedSynonym
annotated target: sucrose-uridine diphosphate glucosyltransferase activity
has db xref: EC:2.4.1.13

Axiom
annotated source: sucrose synthase activity
annotated property: hasRelatedSynonym
annotated target: uridine diphosphoglucose-fructose glucosyltransferase activity
has db xref: EC:2.4.1.13

amylase activity
type: Class
subclass of: hydrolase activity, hydrolyzing O-glycosyl compounds
IAO_0000115: Catalysis of the hydrolysis of amylose or an amylose derivative.

Axiom
annotated source: amylase activity
annotated property: IAO_0000115
annotated target: Catalysis of the hydrolysis of amylose or an amylose derivative.
has db xref: GOC:ai

beta-amylase activity
type: Class
subclass of: amylase activity
IAO_0000115: Catalysis of the reaction: (1,4-alpha-D-glucosyl)(n+1) + H2O = (1,4-alpha-D-glucosyl)(n-1) + alpha-maltose. This reaction is the hydrolysis of 1,4-alpha-glucosidic linkages in polysaccharides so as to remove successive maltose units from the non-reducing ends of the chains.
has broad synonym: glycogenase activity
has related synonym: 4-alpha-D-glucan maltohydrolase activity
has related synonym: beta amylase activity
has related synonym: saccharogen amylase activity

Axiom
annotated source: beta-amylase activity
annotated property: IAO_0000115
annotated target: Catalysis of the reaction: (1,4-alpha-D-glucosyl)(n+1) + H2O = (1,4-alpha-D-glucosyl)(n-1) + alpha-maltose. This reaction is the hydrolysis of 1,4-alpha-glucosidic linkages in polysaccharides so as to remove successive maltose units from the non-reducing ends of the chains.
has db xref: PMID:18390594

Axiom
annotated source: beta-amylase activity
annotated property: hasBroadSynonym
annotated target: glycogenase activity
has db xref: EC:3.2.1.2

Axiom
annotated source: beta-amylase activity
annotated property: hasRelatedSynonym
annotated target: 4-alpha-D-glucan maltohydrolase activity
has db xref: EC:3.2.1.2

Axiom
annotated source: beta-amylase activity
annotated property: hasRelatedSynonym
annotated target: saccharogen amylase activity
has db xref: EC:3.2.1.2

dephosphorylation
type: Class
subclass of: phosphate-containing compound metabolic process
IAO_0000115: The process of removing one or more phosphoric (ester or anhydride) residues from a molecule.

Axiom
annotated source: dephosphorylation
annotated property: IAO_0000115
annotated target: The process of removing one or more phosphoric (ester or anhydride) residues from a molecule.
has db xref: ISBN:0198506732

transferase activity
type: Class
subclass of: catalytic activity
IAO_0000115: Catalysis of the transfer of a group, e.g. a methyl group, glycosyl group, acyl group, phosphorus-containing, or other groups, from one compound (generally regarded as the donor) to another compound (generally regarded as the acceptor). Transferase is the systematic name for any enzyme of EC class 2.

Axiom
annotated source: transferase activity
annotated property: IAO_0000115
annotated target: Catalysis of the transfer of a group, e.g. a methyl group, glycosyl group, acyl group, phosphorus-containing, or other groups, from one compound (generally regarded as the donor) to another compound (generally regarded as the acceptor). Transferase is the systematic name for any enzyme of EC class 2.
has db xref: ISBN:0198506732

glycosyltransferase activity
type: Class
subclass of: transferase activity
IAO_0000115: Catalysis of the transfer of a glycosyl group from one compound (donor) to another (acceptor).
has exact synonym: transferase activity, transferring glycosyl groups
has exact synonym: transglycosidase activity
has exact synonym: transglycosylase activity
has narrow synonym: transferase activity, transferring other glycosyl groups

Axiom
annotated source: glycosyltransferase activity
annotated property: IAO_0000115
annotated target: Catalysis of the transfer of a glycosyl group from one compound (donor) to another (acceptor).
has db xref: GOC:jl
has db xref: ISBN:0198506732

hexosyltransferase activity
type: Class
subclass of: glycosyltransferase activity
IAO_0000115: Catalysis of the transfer of a hexosyl group from one compound (donor) to another (acceptor).
has exact synonym: transferase activity, transferring hexosyl groups

Axiom
annotated source: hexosyltransferase activity
annotated property: IAO_0000115
annotated target: Catalysis of the transfer of a hexosyl group from one compound (donor) to another (acceptor).
has db xref: GOC:jl

transferase activity, transferring phosphorus-containing groups
type: Class
subclass of: transferase activity
IAO_0000115: Catalysis of the transfer of a phosphorus-containing group from one compound (donor) to another (acceptor).

Axiom
annotated source: transferase activity, transferring phosphorus-containing groups
annotated property: IAO_0000115
annotated target: Catalysis of the transfer of a phosphorus-containing group from one compound (donor) to another (acceptor).
has db xref: GOC:jl
has db xref: ISBN:0198506732

nucleotidyltransferase activity
type: Class
subclass of: transferase activity, transferring phosphorus-containing groups
IAO_0000115: Catalysis of the transfer of a nucleotidyl group to a reactant.

Axiom
annotated source: nucleotidyltransferase activity
annotated property: IAO_0000115
annotated target: Catalysis of the transfer of a nucleotidyl group to a reactant.
has db xref: ISBN:0198506732

hydrolase activity
type: Class
subclass of: catalytic activity
IAO_0000115: Catalysis of the hydrolysis of various bonds, e.g. C-O, C-N, C-C, phosphoric anhydride bonds, etc.

Axiom
annotated source: hydrolase activity
annotated property: IAO_0000115
annotated target: Catalysis of the hydrolysis of various bonds, e.g. C-O, C-N, C-C, phosphoric anhydride bonds, etc.
has db xref: ISBN:0198506732

hydrolase activity, acting on ester bonds
type: Class
subclass of: hydrolase activity
IAO_0000115: Catalysis of the hydrolysis of any ester bond.
has exact synonym: esterase activity

Axiom
annotated source: hydrolase activity, acting on ester bonds
annotated property: IAO_0000115
annotated target: Catalysis of the hydrolysis of any ester bond.
has db xref: GOC:jl

phosphatase activity
type: Class
subclass of: phosphoric ester hydrolase activity
IAO_0000115: Catalysis of the hydrolysis of phosphoric monoesters, releasing inorganic phosphate.
has exact synonym: phosphoric monoester hydrolase activity
has narrow synonym: 4-nitrophenylphosphatase activity
has narrow synonym: 4-nitrophenylphosphate phosphohydrolase activity
has narrow synonym: K-pNPPase activity
has narrow synonym: NPPase activity
has narrow synonym: PNPPase activity
has narrow synonym: ecto-p-nitrophenyl phosphatase activity
has narrow synonym: nitrophenyl phosphatase activity
has narrow synonym: p-nitrophenylphosphatase activity
has narrow synonym: p-nitrophenylphosphate phosphohydrolase activity
has narrow synonym: para-nitrophenyl phosphatase activity
has related synonym: phosphatase

Axiom
annotated source: phosphatase activity
annotated property: IAO_0000115
annotated target: Catalysis of the hydrolysis of phosphoric monoesters, releasing inorganic phosphate.
has db xref: GOC:curators
has db xref: GOC:pg

hydrolase activity, acting on glycosyl bonds
type: Class
subclass of: hydrolase activity
IAO_0000115: Catalysis of the hydrolysis of any glycosyl bond.
has exact synonym: glycosidase activity
has narrow synonym: N-glycosylase
has narrow synonym: glycosylase

Axiom
annotated source: hydrolase activity, acting on glycosyl bonds
annotated property: IAO_0000115
annotated target: Catalysis of the hydrolysis of any glycosyl bond.
has db xref: GOC:jl

regulation of phosphate metabolic process
type: Class
equivalent class: Class
  intersection of: biological regulation
  intersection of: Restriction
    on property: RO_0002211
    some values from: phosphate-containing compound metabolic process
subclass of: regulation of phosphorus metabolic process
subclass of: Restriction
  on property: RO_0002211
  some values from: phosphate-containing compound metabolic process
IAO_0000115: Any process that modulates the frequency, rate or extent of the chemical reactions and pathways involving phosphates.
has exact synonym: regulation of phosphate metabolism

Axiom
annotated source: regulation of phosphate metabolic process
annotated property: IAO_0000115
annotated target: Any process that modulates the frequency, rate or extent of the chemical reactions and pathways involving phosphates.
has db xref: GOC:go_curators

regulation of metabolic process
type: Class
equivalent class: Class
  intersection of: biological regulation
  intersection of: Restriction
    on property: RO_0002211
    some values from: metabolic process
subclass of: regulation of biological process
subclass of: Restriction
  on property: RO_0002211
  some values from: metabolic process
IAO_0000115: Any process that modulates the frequency, rate or extent of the chemical reactions and pathways within a cell or an organism.
has exact synonym: regulation of metabolism
has narrow synonym: regulation of multicellular organismal metabolic process
has narrow synonym: regulation of organismal metabolic process

Axiom
annotated source: regulation of metabolic process
annotated property: IAO_0000115
annotated target: Any process that modulates the frequency, rate or extent of the chemical reactions and pathways within a cell or an organism.
has db xref: GOC:go_curators

Axiom
annotated source: regulation of metabolic process
annotated property: hasNarrowSynonym
annotated target: regulation of organismal metabolic process
has db xref: GOC:tb

aromatic compound biosynthetic process
type: Class
subclass of: cellular aromatic compound metabolic process
subclass of: cellular biosynthetic process
IAO_0000115: The chemical reactions and pathways resulting in the formation of aromatic compounds, any substance containing an aromatic carbon ring.
has exact synonym: aromatic compound anabolism
has exact synonym: aromatic compound biosynthesis
has exact synonym: aromatic compound formation
has exact synonym: aromatic compound synthesis
has narrow synonym: aromatic hydrocarbon biosynthesis
has narrow synonym: aromatic hydrocarbon biosynthetic process

Axiom
annotated source: aromatic compound biosynthetic process
annotated property: IAO_0000115
annotated target: The chemical reactions and pathways resulting in the formation of aromatic compounds, any substance containing an aromatic carbon ring.
has db xref: GOC:ai

secondary metabolic process
type: Class
subclass of: metabolic process
IAO_0000115: The chemical reactions and pathways resulting in many of the chemical changes of compounds that are not necessarily required for growth and maintenance of cells, and are often unique to a taxon. In multicellular organisms secondary metabolism is generally carried out in specific cell types, and may be useful for the organism as a whole. In unicellular organisms, secondary metabolism is often used for the production of antibiotics or for the utilization and acquisition of unusual nutrients.
has exact synonym: secondary metabolism
has exact synonym: secondary metabolite metabolic process
has exact synonym: secondary metabolite metabolism

Axiom
annotated source: secondary metabolic process
annotated property: IAO_0000115
annotated target: The chemical reactions and pathways resulting in many of the chemical changes of compounds that are not necessarily required for growth and maintenance of cells, and are often unique to a taxon. In multicellular organisms secondary metabolism is generally carried out in specific cell types, and may be useful for the organism as a whole. In unicellular organisms, secondary metabolism is often used for the production of antibiotics or for the utilization and acquisition of unusual nutrients.
has db xref: GOC:go_curators

sexual reproduction
type: Class
subclass of: reproduction
IAO_0000115: A type of reproduction that combines the genetic material of two gametes (such as a sperm or egg cell or fungal spores). The gametes have an haploid genome (with a single set of chromosomes, the product of a meiotic division) and combines with one another to produce a zygote (diploid).

Axiom
annotated source: sexual reproduction
annotated property: IAO_0000115
annotated target: A type of reproduction that combines the genetic material of two gametes (such as a sperm or egg cell or fungal spores). The gametes have an haploid genome (with a single set of chromosomes, the product of a meiotic division) and combines with one another to produce a zygote (diploid).
has db xref: Wikipedia:Sexual_reproduction

developmental maturation
type: Class
subclass of: developmental process
IAO_0000115: A developmental process, independent of morphogenetic (shape) change, that is required for an anatomical structure, cell or cellular component to attain its fully functional state.

Axiom
annotated source: developmental maturation
annotated property: IAO_0000115
annotated target: A developmental process, independent of morphogenetic (shape) change, that is required for an anatomical structure, cell or cellular component to attain its fully functional state.
has db xref: GOC:cls
has db xref: GOC:dgh
has db xref: GOC:dph
has db xref: GOC:jid
has db xref: GO_REF:0000021

cell cycle process
type: Class
equivalent class: Class
  intersection of: cellular process
  intersection of: Restriction
    on property: BFO_0000050
    some values from: cell cycle
subclass of: cellular process
subclass of: Restriction
  on property: BFO_0000050
  some values from: cell cycle
IAO_0000115: The cellular process that ensures successive accurate and complete genome replication and chromosome segregation.

Axiom
annotated source: cell cycle process
annotated property: IAO_0000115
annotated target: The cellular process that ensures successive accurate and complete genome replication and chromosome segregation.
has db xref: GOC:isa_complete
has db xref: GOC:mtg_cell_cycle

reproductive process
type: Class
equivalent class: Class
  intersection of: biological_process
  intersection of: Restriction
    on property: BFO_0000050
    some values from: reproduction
subclass of: biological_process
subclass of: Restriction
  on property: BFO_0000050
  some values from: reproduction
IAO_0000115: A biological process that directly contributes to the process of producing new individuals by one or two organisms. The new individuals inherit some proportion of their genetic material from the parent or parents.
has related synonym: single organism reproductive process

Axiom
annotated source: reproductive process
annotated property: IAO_0000115
annotated target: A biological process that directly contributes to the process of producing new individuals by one or two organisms. The new individuals inherit some proportion of their genetic material from the parent or parents.
has db xref: GOC:dph
has db xref: GOC:isa_complete

root system development
type: Class
subclass of: system development
IAO_0000115: The process whose specific outcome is the progression of the root system over time, from its formation to the mature structure.

Axiom
annotated source: root system development
annotated property: IAO_0000115
annotated target: The process whose specific outcome is the progression of the root system over time, from its formation to the mature structure.
has db xref: GOC:isa_complete

regulation of signaling
type: Class
equivalent class: Class
  intersection of: biological regulation
  intersection of: Restriction
    on property: RO_0002211
    some values from: signaling
subclass of: regulation of biological process
subclass of: Restriction
  on property: RO_0002211
  some values from: signaling
IAO_0000115: Any process that modulates the frequency, rate or extent of a signaling process.
has related synonym: regulation of signaling process
has related synonym: regulation of signalling process

Axiom
annotated source: regulation of signaling
annotated property: IAO_0000115
annotated target: Any process that modulates the frequency, rate or extent of a signaling process.
has db xref: GOC:mtg_signal

Axiom
annotated source: regulation of signaling
annotated property: hasRelatedSynonym
annotated target: regulation of signaling process
has db xref: GOC:bf

Axiom
annotated source: regulation of signaling
annotated property: hasRelatedSynonym
annotated target: regulation of signalling process
has db xref: GOC:mah

signaling
type: Class
subclass of: regulation of biological process
IAO_0000115: The entirety of a process in which information is transmitted within a biological system. This process begins with an active signal and ends when a cellular response has been triggered.
has exact synonym: biological signaling
has exact synonym: signaling process
has exact synonym: signalling
has related synonym: signalling process
has related synonym: single organism signaling

Axiom
annotated source: signaling
annotated property: IAO_0000115
annotated target: The entirety of a process in which information is transmitted within a biological system. This process begins with an active signal and ends when a cellular response has been triggered.
has db xref: GOC:mtg_signal
has db xref: GOC:mtg_signaling_feb11
has db xref: GOC:signaling

Axiom
annotated source: signaling
annotated property: hasRelatedSynonym
annotated target: signalling process
has db xref: GOC:mah

positive regulation of signaling
type: Class
equivalent class: Class
  intersection of: biological regulation
  intersection of: Restriction
    on property: RO_0002213
    some values from: signaling
subclass of: regulation of signaling
subclass of: positive regulation of biological process
subclass of: Restriction
  on property: RO_0002213
  some values from: signaling
IAO_0000115: Any process that activates, maintains or increases the frequency, rate or extent of a signaling process.
has exact synonym: positive regulation of signalling process
has related synonym: positive regulation of signaling process

Axiom
annotated source: positive regulation of signaling
annotated property: IAO_0000115
annotated target: Any process that activates, maintains or increases the frequency, rate or extent of a signaling process.
has db xref: GOC:mtg_signal

Axiom
annotated source: positive regulation of signaling
annotated property: hasExactSynonym
annotated target: positive regulation of signalling process
has db xref: GOC:mah

Axiom
annotated source: positive regulation of signaling
annotated property: hasRelatedSynonym
annotated target: positive regulation of signaling process
has db xref: GOC:bf

signaling receptor regulator activity
type: Class
subclass of: molecular function regulator activity
IAO_0000115: Binds to and modulates the activity of a receptor.
has broad synonym: receptor regulator activity

Axiom
annotated source: signaling receptor regulator activity
annotated property: IAO_0000115
annotated target: Binds to and modulates the activity of a receptor.
has db xref: GOC:ceb

signaling receptor activator activity
type: Class
subclass of: signaling receptor regulator activity
subclass of: molecular function activator activity
IAO_0000115: The function of interacting (directly or indirectly) with receptors such that the proportion of receptors in the active form is increased.
has broad synonym: receptor activator activity
has exact synonym: signalling receptor activator activity

Axiom
annotated source: signaling receptor activator activity
annotated property: IAO_0000115
annotated target: The function of interacting (directly or indirectly) with receptors such that the proportion of receptors in the active form is increased.
has db xref: GOC:ceb

organelle membrane
type: Class
equivalent class: Class
  intersection of: membrane
  intersection of: Restriction
    on property: BFO_0000050
    some values from: membrane-bounded organelle
subclass of: membrane
subclass of: Restriction
  on property: BFO_0000050
  some values from: membrane-bounded organelle
IAO_0000115: A membrane that is one of the two lipid bilayers of an organelle envelope or the outermost membrane of single membrane bound organelle.
has related synonym: intracellular membrane

Axiom
annotated source: organelle membrane
annotated property: IAO_0000115
annotated target: A membrane that is one of the two lipid bilayers of an organelle envelope or the outermost membrane of single membrane bound organelle.
has db xref: GOC:dos
has db xref: GOC:mah

Axiom
annotated source: organelle membrane
annotated property: hasRelatedSynonym
annotated target: intracellular membrane
has db xref: NIF_Subcellular:sao830981606

regulation of cellular metabolic process
type: Class
equivalent class: Class
  intersection of: biological regulation
  intersection of: Restriction
    on property: RO_0002211
    some values from: cellular metabolic process
subclass of: regulation of metabolic process
subclass of: regulation of cellular process
subclass of: Restriction
  on property: RO_0002211
  some values from: cellular metabolic process
IAO_0000115: Any process that modulates the frequency, rate or extent of the chemical reactions and pathways by which individual cells transform chemical substances.
has exact synonym: regulation of cellular metabolism

Axiom
annotated source: regulation of cellular metabolic process
annotated property: IAO_0000115
annotated target: Any process that modulates the frequency, rate or extent of the chemical reactions and pathways by which individual cells transform chemical substances.
has db xref: GOC:mah

positive regulation of cellular metabolic process
type: Class
equivalent class: Class
  intersection of: biological regulation
  intersection of: Restriction
    on property: RO_0002213
    some values from: cellular metabolic process
subclass of: positive regulation of metabolic process
subclass of: regulation of cellular metabolic process
subclass of: positive regulation of cellular process
subclass of: Restriction
  on property: RO_0002213
  some values from: cellular metabolic process
IAO_0000115: Any process that activates or increases the frequency, rate or extent of the chemical reactions and pathways by which individual cells transform chemical substances.
has exact synonym: positive regulation of cellular metabolism
has exact synonym: up regulation of cellular metabolic process
has exact synonym: up-regulation of cellular metabolic process
has exact synonym: upregulation of cellular metabolic process
has narrow synonym: activation of cellular metabolic process
has narrow synonym: stimulation of cellular metabolic process

Axiom
annotated source: positive regulation of cellular metabolic process
annotated property: IAO_0000115
annotated target: Any process that activates or increases the frequency, rate or extent of the chemical reactions and pathways by which individual cells transform chemical substances.
has db xref: GOC:mah

regulation of cellular biosynthetic process
type: Class
equivalent class: Class
  intersection of: biological regulation
  intersection of: Restriction
    on property: RO_0002211
    some values from: cellular biosynthetic process
subclass of: regulation of biosynthetic process
subclass of: regulation of cellular metabolic process
subclass of: Restriction
  on property: RO_0002211
  some values from: cellular biosynthetic process
IAO_0000115: Any process that modulates the frequency, rate or extent of the chemical reactions and pathways resulting in the formation of substances, carried out by individual cells.
has exact synonym: regulation of cellular anabolism
has exact synonym: regulation of cellular biosynthesis
has exact synonym: regulation of cellular formation
has exact synonym: regulation of cellular synthesis

Axiom
annotated source: regulation of cellular biosynthetic process
annotated property: IAO_0000115
annotated target: Any process that modulates the frequency, rate or extent of the chemical reactions and pathways resulting in the formation of substances, carried out by individual cells.
has db xref: GOC:mah

positive regulation of cellular biosynthetic process
type: Class
equivalent class: Class
  intersection of: biological regulation
  intersection of: Restriction
    on property: RO_0002213
    some values from: cellular biosynthetic process
subclass of: positive regulation of biosynthetic process
subclass of: positive regulation of cellular metabolic process
subclass of: regulation of cellular biosynthetic process
subclass of: Restriction
  on property: RO_0002213
  some values from: cellular biosynthetic process
IAO_0000115: Any process that activates or increases the frequency, rate or extent of the chemical reactions and pathways resulting in the formation of substances, carried out by individual cells.
has exact synonym: positive regulation of cellular anabolism
has exact synonym: positive regulation of cellular biosynthesis
has exact synonym: positive regulation of cellular formation
has exact synonym: positive regulation of cellular synthesis
has exact synonym: up regulation of cellular biosynthetic process
has exact synonym: up-regulation of cellular biosynthetic process
has exact synonym: upregulation of cellular biosynthetic process
has narrow synonym: activation of cellular biosynthetic process
has narrow synonym: stimulation of cellular biosynthetic process

Axiom
annotated source: positive regulation of cellular biosynthetic process
annotated property: IAO_0000115
annotated target: Any process that activates or increases the frequency, rate or extent of the chemical reactions and pathways resulting in the formation of substances, carried out by individual cells.
has db xref: GOC:mah

organelle envelope
type: Class
subclass of: envelope
subclass of: Restriction
  on property: BFO_0000050
  some values from: membrane-bounded organelle
subclass of: Restriction
  on property: BFO_0000050
  some values from: intracellular organelle
IAO_0000115: A double membrane structure enclosing an organelle, including two lipid bilayers and the region between them. In some cases, an organelle envelope may have more than two membranes.

Axiom
annotated source: organelle envelope
annotated property: IAO_0000115
annotated target: A double membrane structure enclosing an organelle, including two lipid bilayers and the region between them. In some cases, an organelle envelope may have more than two membranes.
has db xref: GOC:mah
has db xref: GOC:pz

envelope
type: Class
subclass of: cellular anatomical entity
IAO_0000115: A multilayered structure surrounding all or part of a cell; encompasses one or more lipid bilayers, and may include a cell wall layer; also includes the space between layers.

Axiom
annotated source: envelope
annotated property: IAO_0000115
annotated target: A multilayered structure surrounding all or part of a cell; encompasses one or more lipid bilayers, and may include a cell wall layer; also includes the space between layers.
has db xref: GOC:mah
has db xref: GOC:pz

positive regulation of protein binding
type: Class
equivalent class: Class
  intersection of: biological regulation
  intersection of: Restriction
    on property: RO_0002213
    some values from: protein binding
subclass of: regulation of protein binding
subclass of: positive regulation of binding
subclass of: Restriction
  on property: RO_0002213
  some values from: protein binding
IAO_0000115: Any process that activates or increases the frequency, rate or extent of protein binding.
has exact synonym: up regulation of protein binding
has exact synonym: up-regulation of protein binding
has exact synonym: upregulation of protein binding
has narrow synonym: activation of protein binding
has narrow synonym: stimulation of protein binding

Axiom
annotated source: positive regulation of protein binding
annotated property: IAO_0000115
annotated target: Any process that activates or increases the frequency, rate or extent of protein binding.
has db xref: GOC:mah

multicellular organismal process
type: Class
subclass of: biological_process
IAO_0000115: Any biological process, occurring at the level of a multicellular organism, pertinent to its function.
has exact synonym: organismal physiological process
has related synonym: single-multicellular organism process

Axiom
annotated source: multicellular organismal process
annotated property: IAO_0000115
annotated target: Any biological process, occurring at the level of a multicellular organism, pertinent to its function.
has db xref: GOC:curators
has db xref: GOC:dph
has db xref: GOC:isa_complete
has db xref: GOC:tb

developmental process
type: Class
subclass of: biological_process
IAO_0000115: A biological process whose specific outcome is the progression of an integrated living unit: an anatomical structure (which may be a subcellular structure, cell, tissue, or organ), or organism over time from an initial condition to a later condition.
has narrow synonym: development
has related synonym: single-organism developmental process

Axiom
annotated source: developmental process
annotated property: IAO_0000115
annotated target: A biological process whose specific outcome is the progression of an integrated living unit: an anatomical structure (which may be a subcellular structure, cell, tissue, or organ), or organism over time from an initial condition to a later condition.
has db xref: GOC:isa_complete

plasma membrane bounded cell projection cytoplasm
type: Class
equivalent class: Class
  intersection of: cytoplasm
  intersection of: Restriction
    on property: BFO_0000050
    some values from: plasma membrane bounded cell projection
subclass of: cytoplasmic region
subclass of: Restriction
  on property: BFO_0000050
  some values from: plasma membrane bounded cell projection
IAO_0000115: All of the contents of a plasma membrane bounded cell projection, excluding the plasma membrane surrounding the projection.

Axiom
annotated source: plasma membrane bounded cell projection cytoplasm
annotated property: IAO_0000115
annotated target: All of the contents of a plasma membrane bounded cell projection, excluding the plasma membrane surrounding the projection.
has db xref: GOC:krc
has db xref: GOC:mah

regulation of localization
type: Class
equivalent class: Class
  intersection of: biological regulation
  intersection of: Restriction
    on property: RO_0002211
    some values from: localization
subclass of: regulation of biological process
subclass of: Restriction
  on property: RO_0002211
  some values from: localization
IAO_0000115: Any process that modulates the frequency, rate or extent of any process in which a cell, a substance, or a cellular entity is transported to, or maintained in, a specific location.
has exact synonym: regulation of localisation

Axiom
annotated source: regulation of localization
annotated property: IAO_0000115
annotated target: Any process that modulates the frequency, rate or extent of any process in which a cell, a substance, or a cellular entity is transported to, or maintained in, a specific location.
has db xref: GOC:mah

Axiom
annotated source: regulation of localization
annotated property: hasExactSynonym
annotated target: regulation of localisation
has db xref: GOC:mah

regulation of organelle organization
type: Class
equivalent class: Class
  intersection of: biological regulation
  intersection of: Restriction
    on property: RO_0002211
    some values from: organelle organization
subclass of: regulation of cellular component organization
subclass of: Restriction
  on property: RO_0002211
  some values from: organelle organization
IAO_0000115: Any process that modulates the frequency, rate or extent of a process involved in the formation, arrangement of constituent parts, or disassembly of an organelle.
has exact synonym: regulation of organelle organisation
has related synonym: regulation of organelle organization and biogenesis

Axiom
annotated source: regulation of organelle organization
annotated property: IAO_0000115
annotated target: Any process that modulates the frequency, rate or extent of a process involved in the formation, arrangement of constituent parts, or disassembly of an organelle.
has db xref: GOC:mah

Axiom
annotated source: regulation of organelle organization
annotated property: hasExactSynonym
annotated target: regulation of organelle organisation
has db xref: GOC:mah

Axiom
annotated source: regulation of organelle organization
annotated property: hasRelatedSynonym
annotated target: regulation of organelle organization and biogenesis
has db xref: GOC:mah

UDP-glucosyltransferase activity
type: Class
subclass of: UDP-glycosyltransferase activity
subclass of: glucosyltransferase activity
IAO_0000115: Catalysis of the transfer of a glucosyl group from UDP-glucose to an acceptor molecule.

Axiom
annotated source: UDP-glucosyltransferase activity
annotated property: IAO_0000115
annotated target: Catalysis of the transfer of a glucosyl group from UDP-glucose to an acceptor molecule.
has db xref: PMID:19858195

regulation of dephosphorylation
type: Class
equivalent class: Class
  intersection of: biological regulation
  intersection of: Restriction
    on property: RO_0002211
    some values from: dephosphorylation
subclass of: regulation of phosphate metabolic process
subclass of: Restriction
  on property: RO_0002211
  some values from: dephosphorylation
IAO_0000115: Any process that modulates the frequency, rate or extent of removal of phosphate groups from a molecule.

Axiom
annotated source: regulation of dephosphorylation
annotated property: IAO_0000115
annotated target: Any process that modulates the frequency, rate or extent of removal of phosphate groups from a molecule.
has db xref: GOC:bf

positive regulation of dephosphorylation
type: Class
equivalent class: Class
  intersection of: biological regulation
  intersection of: Restriction
    on property: RO_0002213
    some values from: dephosphorylation
subclass of: regulation of dephosphorylation
subclass of: positive regulation of phosphate metabolic process
subclass of: Restriction
  on property: RO_0002213
  some values from: dephosphorylation
IAO_0000115: Any process that activates or increases the frequency, rate or extent of removal of phosphate groups from a molecule.
has exact synonym: up regulation of dephosphorylation
has exact synonym: up-regulation of dephosphorylation
has exact synonym: upregulation of dephosphorylation
has narrow synonym: activation of dephosphorylation
has narrow synonym: stimulation of dephosphorylation

Axiom
annotated source: positive regulation of dephosphorylation
annotated property: IAO_0000115
annotated target: Any process that activates or increases the frequency, rate or extent of removal of phosphate groups from a molecule.
has db xref: GOC:bf

root hair
type: Class
subclass of: plasma membrane bounded cell projection
IAO_0000115: A long, thin projection from a root epidermal cell that contains F-actin and tubulin, and a cell wall.

Axiom
annotated source: root hair
annotated property: IAO_0000115
annotated target: A long, thin projection from a root epidermal cell that contains F-actin and tubulin, and a cell wall.
has db xref: PO:0000256
has db xref: http://www.jstor.org/stable/4354264

signaling receptor activity
type: Class
subclass of: molecular transducer activity
IAO_0000115: Receiving a signal and transmitting it in the cell to initiate a change in cell activity. A signal is a physical entity or change in state that is used to transfer information in order to trigger a response.
has broad synonym: receptor activity
has exact synonym: receptor activity involved in signal transduction
has exact synonym: signalling receptor activity

Axiom
annotated source: signaling receptor activity
annotated property: IAO_0000115
annotated target: Receiving a signal and transmitting it in the cell to initiate a change in cell activity. A signal is a physical entity or change in state that is used to transfer information in order to trigger a response.
has db xref: GOC:bf
has db xref: GOC:signaling

Axiom
annotated source: signaling receptor activity
annotated property: hasExactSynonym
annotated target: receptor activity involved in signal transduction
has db xref: GOC:bf

regulation of meiotic nuclear division
type: Class
equivalent class: Class
  intersection of: biological regulation
  intersection of: Restriction
    on property: RO_0002211
    some values from: meiotic nuclear division
subclass of: regulation of cell cycle process
subclass of: regulation of meiotic cell cycle
subclass of: regulation of nuclear division
subclass of: Restriction
  on property: RO_0002211
  some values from: meiotic nuclear division
IAO_0000115: Any process that modulates the frequency, rate or extent of meiotic nuclear division, the process in which the nucleus of a diploid cell divides twice forming four haploid cells, one or more of which usually function as gametes.
has broad synonym: regulation of meiosis

Axiom
annotated source: regulation of meiotic nuclear division
annotated property: IAO_0000115
annotated target: Any process that modulates the frequency, rate or extent of meiotic nuclear division, the process in which the nucleus of a diploid cell divides twice forming four haploid cells, one or more of which usually function as gametes.
has db xref: GOC:ems
has db xref: GOC:ma

Axiom
annotated source: regulation of meiotic nuclear division
annotated property: hasBroadSynonym
annotated target: regulation of meiosis
has db xref: GOC:vw

fluid transport
type: Class
subclass of: transport
IAO_0000115: The directed movement of substances that are in liquid form in normal living conditions into, out of or within a cell, or between cells, by means of some agent such as a transporter or pore.

Axiom
annotated source: fluid transport
annotated property: IAO_0000115
annotated target: The directed movement of substances that are in liquid form in normal living conditions into, out of or within a cell, or between cells, by means of some agent such as a transporter or pore.
has db xref: GOC:ai

plastid membrane
type: Class
equivalent class: Class
  intersection of: membrane
  intersection of: Restriction
    on property: BFO_0000050
    some values from: plastid
subclass of: organelle membrane
subclass of: Restriction
  on property: BFO_0000050
  some values from: plastid envelope
IAO_0000115: Either of the lipid bilayers that surround a plastid and form the plastid envelope.

Axiom
annotated source: plastid membrane
annotated property: IAO_0000115
annotated target: Either of the lipid bilayers that surround a plastid and form the plastid envelope.
has db xref: GOC:mah

phosphoric ester hydrolase activity
type: Class
subclass of: hydrolase activity, acting on ester bonds
IAO_0000115: Catalysis of the reaction: RPO-R' + H2O = RPOOH + R'H. This reaction is the hydrolysis of any phosphoric ester bond, any ester formed from orthophosphoric acid, O=P(OH)3.

Axiom
annotated source: phosphoric ester hydrolase activity
annotated property: IAO_0000115
annotated target: Catalysis of the reaction: RPO-R' + H2O = RPOOH + R'H. This reaction is the hydrolysis of any phosphoric ester bond, any ester formed from orthophosphoric acid, O=P(OH)3.
has db xref: GOC:jl

cell projection
type: Class
subclass of: cellular anatomical entity
IAO_0000115: A prolongation or process extending from a cell, e.g. a flagellum or axon.
has broad synonym: cell process
has broad synonym: cellular process
has exact synonym: cellular projection

Axiom
annotated source: cell projection
annotated property: IAO_0000115
annotated target: A prolongation or process extending from a cell, e.g. a flagellum or axon.
has db xref: GOC:jl
has db xref: http://www.cogsci.princeton.edu/~wn/

starch grain
type: Class
subclass of: cellular anatomical entity
subclass of: Restriction
  on property: BFO_0000050
  some values from: plastid
IAO_0000115: Plant storage body for amylose and amylopectin, 1-100um in diameter. Also contains small amounts of enzymes, amino acids, lipids and nucleic acids. The shape of the grain varies widely amongst species, but is often spherical or disk-shaped.
has exact synonym: starch granule

Axiom
annotated source: starch grain
annotated property: IAO_0000115
annotated target: Plant storage body for amylose and amylopectin, 1-100um in diameter. Also contains small amounts of enzymes, amino acids, lipids and nucleic acids. The shape of the grain varies widely amongst species, but is often spherical or disk-shaped.
has db xref: GOC:jl
has db xref: PMID:11217978

positive regulation of catalytic activity
type: Class
equivalent class: Class
  intersection of: biological regulation
  intersection of: Restriction
    on property: RO_0002213
    some values from: catalytic activity
subclass of: positive regulation of molecular function
subclass of: regulation of catalytic activity
subclass of: Restriction
  on property: RO_0002213
  some values from: catalytic activity
IAO_0000115: Any process that activates or increases the activity of an enzyme.
has exact synonym: positive regulation of enzyme activity
has exact synonym: up regulation of enzyme activity
has exact synonym: up-regulation of enzyme activity
has exact synonym: upregulation of enzyme activity
has narrow synonym: activation of enzyme activity
has narrow synonym: activation of metalloenzyme activity
has narrow synonym: positive regulation of metalloenzyme activity
has narrow synonym: stimulation of enzyme activity
has narrow synonym: stimulation of metalloenzyme activity
has narrow synonym: up regulation of metalloenzyme activity
has narrow synonym: up-regulation of metalloenzyme activity
has narrow synonym: upregulation of metalloenzyme activity

Axiom
annotated source: positive regulation of catalytic activity
annotated property: IAO_0000115
annotated target: Any process that activates or increases the activity of an enzyme.
has db xref: GOC:ebc
has db xref: GOC:jl
has db xref: GOC:tb
has db xref: GOC:vw

Axiom
annotated source: positive regulation of catalytic activity
annotated property: hasExactSynonym
annotated target: positive regulation of enzyme activity
has db xref: GOC:tb

organelle
type: Class
subclass of: cellular anatomical entity
IAO_0000115: Organized structure of distinctive morphology and function. Includes the nucleus, mitochondria, plastids, vacuoles, vesicles, ribosomes and the cytoskeleton, and prokaryotic structures such as anammoxosomes and pirellulosomes. Excludes the plasma membrane.

Axiom
annotated source: organelle
annotated property: IAO_0000115
annotated target: Organized structure of distinctive morphology and function. Includes the nucleus, mitochondria, plastids, vacuoles, vesicles, ribosomes and the cytoskeleton, and prokaryotic structures such as anammoxosomes and pirellulosomes. Excludes the plasma membrane.
has db xref: GOC:go_curators

membrane-bounded organelle
type: Class
equivalent class: Class
  intersection of: organelle
  intersection of: Restriction
    on property: BFO_0000051
    some values from: membrane
subclass of: organelle
subclass of: Restriction
  on property: BFO_0000051
  some values from: membrane
IAO_0000115: Organized structure of distinctive morphology and function, bounded by a single or double lipid bilayer membrane. Includes the nucleus, mitochondria, plastids, vacuoles, and vesicles. Excludes the plasma membrane.
has exact synonym: membrane-enclosed organelle

Axiom
annotated source: membrane-bounded organelle
annotated property: IAO_0000115
annotated target: Organized structure of distinctive morphology and function, bounded by a single or double lipid bilayer membrane. Includes the nucleus, mitochondria, plastids, vacuoles, and vesicles. Excludes the plasma membrane.
has db xref: GOC:go_curators

intracellular organelle
type: Class
equivalent class: Class
  intersection of: organelle
  intersection of: Restriction
    on property: BFO_0000050
    some values from: intracellular anatomical structure
subclass of: organelle
subclass of: Restriction
  on property: BFO_0000050
  some values from: intracellular anatomical structure
IAO_0000115: Organized structure of distinctive morphology and function, occurring within the cell. Includes the nucleus, mitochondria, plastids, vacuoles, vesicles, ribosomes and the cytoskeleton. Excludes the plasma membrane.

Axiom
annotated source: intracellular organelle
annotated property: IAO_0000115
annotated target: Organized structure of distinctive morphology and function, occurring within the cell. Includes the nucleus, mitochondria, plastids, vacuoles, vesicles, ribosomes and the cytoskeleton. Excludes the plasma membrane.
has db xref: GOC:go_curators

intracellular membrane-bounded organelle
type: Class
equivalent class: Class
  intersection of: membrane-bounded organelle
  intersection of: Restriction
    on property: BFO_0000050
    some values from: intracellular anatomical structure
subclass of: membrane-bounded organelle
subclass of: intracellular organelle
IAO_0000115: Organized structure of distinctive morphology and function, bounded by a single or double lipid bilayer membrane and occurring within the cell. Includes the nucleus, mitochondria, plastids, vacuoles, and vesicles. Excludes the plasma membrane.
has exact synonym: intracellular membrane-enclosed organelle

Axiom
annotated source: intracellular membrane-bounded organelle
annotated property: IAO_0000115
annotated target: Organized structure of distinctive morphology and function, bounded by a single or double lipid bilayer membrane and occurring within the cell. Includes the nucleus, mitochondria, plastids, vacuoles, and vesicles. Excludes the plasma membrane.
has db xref: GOC:go_curators

regulation of protein binding
type: Class
equivalent class: Class
  intersection of: biological regulation
  intersection of: Restriction
    on property: RO_0002211
    some values from: protein binding
subclass of: regulation of binding
subclass of: Restriction
  on property: RO_0002211
  some values from: protein binding
IAO_0000115: Any process that modulates the frequency, rate or extent of protein binding.

Axiom
annotated source: regulation of protein binding
annotated property: IAO_0000115
annotated target: Any process that modulates the frequency, rate or extent of protein binding.
has db xref: GOC:go_curators

regulation of secondary metabolic process
type: Class
equivalent class: Class
  intersection of: biological regulation
  intersection of: Restriction
    on property: RO_0002211
    some values from: secondary metabolic process
subclass of: regulation of metabolic process
subclass of: Restriction
  on property: RO_0002211
  some values from: secondary metabolic process
IAO_0000115: Any process that modulates the frequency, rate or extent of secondary metabolism, the chemical reactions and pathways involving compounds that are not necessarily required for growth and maintenance of cells, and are often unique to a taxon.
has exact synonym: regulation of secondary metabolism

Axiom
annotated source: regulation of secondary metabolic process
annotated property: IAO_0000115
annotated target: Any process that modulates the frequency, rate or extent of secondary metabolism, the chemical reactions and pathways involving compounds that are not necessarily required for growth and maintenance of cells, and are often unique to a taxon.
has db xref: GOC:jl

regulation of respiratory gaseous exchange
type: Class
equivalent class: Class
  intersection of: biological regulation
  intersection of: Restriction
    on property: RO_0002211
    some values from: respiratory gaseous exchange by respiratory system
subclass of: regulation of multicellular organismal process
subclass of: Restriction
  on property: RO_0002211
  some values from: respiratory gaseous exchange by respiratory system
IAO_0000115: Any process that modulates the frequency, rate or extent of the process of gaseous exchange between an organism and its environment.

Axiom
annotated source: regulation of respiratory gaseous exchange
annotated property: IAO_0000115
annotated target: Any process that modulates the frequency, rate or extent of the process of gaseous exchange between an organism and its environment.
has db xref: GOC:jl

positive regulation of molecular function
type: Class
equivalent class: Class
  intersection of: biological regulation
  intersection of: Restriction
    on property: RO_0002213
    some values from: molecular_function
subclass of: regulation of molecular function
subclass of: Restriction
  on property: RO_0002213
  some values from: molecular_function
IAO_0000115: Any process that activates or increases the rate or extent of a molecular function, an elemental biological activity occurring at the molecular level, such as catalysis or binding.

Axiom
annotated source: positive regulation of molecular function
annotated property: IAO_0000115
annotated target: Any process that activates or increases the rate or extent of a molecular function, an elemental biological activity occurring at the molecular level, such as catalysis or binding.
has db xref: GO:jl

cellular metabolic process
type: Class
subclass of: metabolic process
subclass of: cellular process
IAO_0000115: The chemical reactions and pathways by which individual cells transform chemical substances.
has exact synonym: cellular metabolism
has related synonym: intermediary metabolism

Axiom
annotated source: cellular metabolic process
annotated property: IAO_0000115
annotated target: The chemical reactions and pathways by which individual cells transform chemical substances.
has db xref: GOC:go_curators

Axiom
annotated source: cellular metabolic process
annotated property: hasRelatedSynonym
annotated target: intermediary metabolism
has db xref: GOC:mah

cellular biosynthetic process
type: Class
subclass of: biosynthetic process
subclass of: cellular metabolic process
IAO_0000115: The chemical reactions and pathways resulting in the formation of substances, carried out by individual cells.
has exact synonym: cellular anabolism
has exact synonym: cellular biosynthesis
has exact synonym: cellular formation
has exact synonym: cellular synthesis

Axiom
annotated source: cellular biosynthetic process
annotated property: IAO_0000115
annotated target: The chemical reactions and pathways resulting in the formation of substances, carried out by individual cells.
has db xref: GOC:jl

secondary metabolite biosynthetic process
type: Class
subclass of: biosynthetic process
subclass of: secondary metabolic process
IAO_0000115: The chemical reactions and pathways resulting in the formation of secondary metabolites, the compounds that are not necessarily required for growth and maintenance of cells, and are often unique to a taxon.
has exact synonym: secondary metabolite biosynthesis

Axiom
annotated source: secondary metabolite biosynthetic process
annotated property: IAO_0000115
annotated target: The chemical reactions and pathways resulting in the formation of secondary metabolites, the compounds that are not necessarily required for growth and maintenance of cells, and are often unique to a taxon.
has db xref: GOC:jl

nutrient reservoir activity
type: Class
subclass of: molecular_function
IAO_0000115: Functions in the storage of nutritious substrates.
has related synonym: storage protein
has related synonym: storage protein of fat body
has related synonym: yolk protein

Axiom
annotated source: nutrient reservoir activity
annotated property: IAO_0000115
annotated target: Functions in the storage of nutritious substrates.
has db xref: GOC:ai

positive regulation of cell cycle
type: Class
equivalent class: Class
  intersection of: biological regulation
  intersection of: Restriction
    on property: RO_0002213
    some values from: cell cycle
subclass of: positive regulation of cellular process
subclass of: regulation of cell cycle
subclass of: Restriction
  on property: RO_0002213
  some values from: cell cycle
IAO_0000115: Any process that activates or increases the rate or extent of progression through the cell cycle.
has exact synonym: positive regulation of cell cycle progression
has exact synonym: positive regulation of progression through cell cycle
has exact synonym: up regulation of progression through cell cycle
has exact synonym: up-regulation of progression through cell cycle
has exact synonym: upregulation of progression through cell cycle
has narrow synonym: activation of progression through cell cycle
has narrow synonym: stimulation of progression through cell cycle

Axiom
annotated source: positive regulation of cell cycle
annotated property: IAO_0000115
annotated target: Any process that activates or increases the rate or extent of progression through the cell cycle.
has db xref: GOC:go_curators

Axiom
annotated source: positive regulation of cell cycle
annotated property: hasExactSynonym
annotated target: positive regulation of progression through cell cycle
has db xref: GOC:dph
has db xref: GOC:tb

positive regulation of meiotic nuclear division
type: Class
equivalent class: Class
  intersection of: biological regulation
  intersection of: Restriction
    on property: RO_0002213
    some values from: meiotic nuclear division
subclass of: regulation of meiotic nuclear division
subclass of: positive regulation of meiotic cell cycle
subclass of: positive regulation of nuclear division
subclass of: positive regulation of cell cycle process
subclass of: Restriction
  on property: RO_0002213
  some values from: meiotic nuclear division
IAO_0000115: Any process that activates or increases the frequency, rate or extent of meiosis.
has exact synonym: positive regulation of meiosis
has exact synonym: up regulation of meiosis
has exact synonym: up-regulation of meiosis
has exact synonym: upregulation of meiosis
has narrow synonym: activation of meiosis
has narrow synonym: stimulation of meiosis

Axiom
annotated source: positive regulation of meiotic nuclear division
annotated property: IAO_0000115
annotated target: Any process that activates or increases the frequency, rate or extent of meiosis.
has db xref: GOC:go_curators

positive regulation of mitotic nuclear division
type: Class
equivalent class: Class
  intersection of: biological regulation
  intersection of: Restriction
    on property: RO_0002213
    some values from: mitotic nuclear division
subclass of: regulation of mitotic nuclear division
subclass of: positive regulation of nuclear division
subclass of: positive regulation of cell cycle process
subclass of: Restriction
  on property: RO_0002213
  some values from: mitotic nuclear division
IAO_0000115: Any process that activates or increases the frequency, rate or extent of mitosis.
has exact synonym: positive regulation of mitosis
has exact synonym: up regulation of mitosis
has exact synonym: up-regulation of mitosis
has exact synonym: upregulation of mitosis
has narrow synonym: activation of mitosis
has narrow synonym: mitogenic activity
has narrow synonym: stimulation of mitosis

Axiom
annotated source: positive regulation of mitotic nuclear division
annotated property: IAO_0000115
annotated target: Any process that activates or increases the frequency, rate or extent of mitosis.
has db xref: GOC:go_curators

positive regulation of mitotic cell cycle
type: Class
equivalent class: Class
  intersection of: biological regulation
  intersection of: Restriction
    on property: RO_0002213
    some values from: mitotic cell cycle
subclass of: regulation of mitotic cell cycle
subclass of: positive regulation of cell cycle
subclass of: Restriction
  on property: RO_0002213
  some values from: mitotic cell cycle
IAO_0000115: Any process that activates or increases the rate or extent of progression through the mitotic cell cycle.
has exact synonym: positive regulation of mitotic cell cycle progression
has exact synonym: positive regulation of progression through mitotic cell cycle
has exact synonym: up regulation of progression through mitotic cell cycle
has exact synonym: up-regulation of progression through mitotic cell cycle
has exact synonym: upregulation of progression through mitotic cell cycle
has narrow synonym: activation of progression through mitotic cell cycle
has narrow synonym: stimulation of progression through mitotic cell cycle

Axiom
annotated source: positive regulation of mitotic cell cycle
annotated property: IAO_0000115
annotated target: Any process that activates or increases the rate or extent of progression through the mitotic cell cycle.
has db xref: GOC:dph
has db xref: GOC:go_curators
has db xref: GOC:tb

Axiom
annotated source: positive regulation of mitotic cell cycle
annotated property: hasExactSynonym
annotated target: positive regulation of progression through mitotic cell cycle
has db xref: GOC:dph
has db xref: GOC:tb

positive regulation of phosphate metabolic process
type: Class
equivalent class: Class
  intersection of: biological regulation
  intersection of: Restriction
    on property: RO_0002213
    some values from: phosphate-containing compound metabolic process
subclass of: positive regulation of phosphorus metabolic process
subclass of: regulation of phosphate metabolic process
subclass of: Restriction
  on property: RO_0002213
  some values from: phosphate-containing compound metabolic process
IAO_0000115: Any process that activates or increases the frequency, rate or extent of the chemical reactions and pathways involving phosphates.
has exact synonym: positive regulation of phosphate metabolism
has exact synonym: up regulation of phosphate metabolic process
has exact synonym: up-regulation of phosphate metabolic process
has exact synonym: upregulation of phosphate metabolic process
has narrow synonym: activation of phosphate metabolic process
has narrow synonym: stimulation of phosphate metabolic process

Axiom
annotated source: positive regulation of phosphate metabolic process
annotated property: IAO_0000115
annotated target: Any process that activates or increases the frequency, rate or extent of the chemical reactions and pathways involving phosphates.
has db xref: GOC:go_curators

sucrose-phosphate synthase activity
type: Class
subclass of: UDP-glucosyltransferase activity
IAO_0000115: Catalysis of the reaction: UDP-glucose + D-fructose 6-phosphate = UDP + sucrose 6-phosphate.
has related synonym: SPS
has related synonym: UDP-glucose-fructose-phosphate glucosyltransferase activity
has related synonym: UDP-glucose:D-fructose-6-phosphate 2-alpha-D-glucosyltransferase activity
has related synonym: UDPglucose-fructose-phosphate glucosyltransferase activity
has related synonym: UDPglucose:D-fructose-6-phosphate 2-alpha-D-glucosyltransferase activity
has related synonym: sucrose 6-phosphate synthase activity
has related synonym: sucrose phosphate synthetase activity
has related synonym: sucrose phosphate-uridine diphosphate glucosyltransferase activity
has related synonym: sucrosephosphate-UDP glucosyltransferase activity
has related synonym: uridine diphosphoglucose-fructose phosphate glucosyltransferase activity

Axiom
annotated source: sucrose-phosphate synthase activity
annotated property: IAO_0000115
annotated target: Catalysis of the reaction: UDP-glucose + D-fructose 6-phosphate = UDP + sucrose 6-phosphate.
has db xref: EC:2.4.1.14

Axiom
annotated source: sucrose-phosphate synthase activity
annotated property: hasRelatedSynonym
annotated target: SPS
has db xref: EC:2.4.1.14

Axiom
annotated source: sucrose-phosphate synthase activity
annotated property: hasRelatedSynonym
annotated target: UDP-glucose-fructose-phosphate glucosyltransferase activity
has db xref: EC:2.4.1.14

Axiom
annotated source: sucrose-phosphate synthase activity
annotated property: hasRelatedSynonym
annotated target: UDP-glucose:D-fructose-6-phosphate 2-alpha-D-glucosyltransferase activity
has db xref: EC:2.4.1.14

Axiom
annotated source: sucrose-phosphate synthase activity
annotated property: hasRelatedSynonym
annotated target: UDPglucose-fructose-phosphate glucosyltransferase activity
has db xref: EC:2.4.1.14

Axiom
annotated source: sucrose-phosphate synthase activity
annotated property: hasRelatedSynonym
annotated target: UDPglucose:D-fructose-6-phosphate 2-alpha-D-glucosyltransferase activity
has db xref: EC:2.4.1.14

Axiom
annotated source: sucrose-phosphate synthase activity
annotated property: hasRelatedSynonym
annotated target: sucrose 6-phosphate synthase activity
has db xref: EC:2.4.1.14

Axiom
annotated source: sucrose-phosphate synthase activity
annotated property: hasRelatedSynonym
annotated target: sucrose phosphate synthetase activity
has db xref: EC:2.4.1.14

Axiom
annotated source: sucrose-phosphate synthase activity
annotated property: hasRelatedSynonym
annotated target: sucrose phosphate-uridine diphosphate glucosyltransferase activity
has db xref: EC:2.4.1.14

Axiom
annotated source: sucrose-phosphate synthase activity
annotated property: hasRelatedSynonym
annotated target: sucrosephosphate-UDP glucosyltransferase activity
has db xref: EC:2.4.1.14

Axiom
annotated source: sucrose-phosphate synthase activity
annotated property: hasRelatedSynonym
annotated target: uridine diphosphoglucose-fructose phosphate glucosyltransferase activity
has db xref: EC:2.4.1.14

glucosyltransferase activity
type: Class
subclass of: hexosyltransferase activity
IAO_0000115: Catalysis of the transfer of a glucosyl group to an acceptor molecule, typically another carbohydrate or a lipid.

Axiom
annotated source: glucosyltransferase activity
annotated property: IAO_0000115
annotated target: Catalysis of the transfer of a glucosyl group to an acceptor molecule, typically another carbohydrate or a lipid.
has db xref: ISBN:0198506732

regulation of response to osmotic stress
type: Class
equivalent class: Class
  intersection of: biological regulation
  intersection of: Restriction
    on property: RO_0002211
    some values from: response to osmotic stress
subclass of: regulation of response to stress
subclass of: Restriction
  on property: RO_0002211
  some values from: response to osmotic stress
IAO_0000115: Any process that modulates the rate or extent of the response to osmotic stress.

Axiom
annotated source: regulation of response to osmotic stress
annotated property: IAO_0000115
annotated target: Any process that modulates the rate or extent of the response to osmotic stress.
has db xref: GOC:ai

receptor ligand activity
type: Class
subclass of: signaling receptor binding
subclass of: signaling receptor activator activity
subclass of: Restriction
  on property: BFO_0000050
  some values from: signal transduction
subclass of: Restriction
  on property: RO_0002213
  some values from: signaling receptor activity
IAO_0000115: The activity of a gene product that interacts with a receptor to effect a change in the activity of the receptor. Ligands may be produced by the same, or different, cell that expresses the receptor. Ligands may diffuse extracellularly from their point of origin to the receiving cell, or remain attached to an adjacent cell surface (e.g. Notch ligands).
has broad synonym: receptor agonist activity
has exact synonym: signaling molecule
has exact synonym: signaling receptor ligand activity
has narrow synonym: vitamin D receptor activator activity

Axiom
annotated source: receptor ligand activity
annotated property: IAO_0000115
annotated target: The activity of a gene product that interacts with a receptor to effect a change in the activity of the receptor. Ligands may be produced by the same, or different, cell that expresses the receptor. Ligands may diffuse extracellularly from their point of origin to the receiving cell, or remain attached to an adjacent cell surface (e.g. Notch ligands).
has db xref: GOC:kv
has db xref: GOC:molecular_function_refactoring
has db xref: GOC:pdt

Axiom
annotated source: receptor ligand activity
annotated property: hasBroadSynonym
annotated target: receptor agonist activity
has db xref: GOC:molecular_function_refactoring

organelle fission
type: Class
subclass of: organelle organization
IAO_0000115: The creation of two or more organelles by division of one organelle.

Axiom
annotated source: organelle fission
annotated property: IAO_0000115
annotated target: The creation of two or more organelles by division of one organelle.
has db xref: GOC:jid

root development
type: Class
subclass of: plant organ development
subclass of: Restriction
  on property: BFO_0000050
  some values from: root system development
IAO_0000115: The process whose specific outcome is the progression of the root over time, from its formation to the mature structure. The root is the water- and mineral-absorbing part of a plant which is usually underground, does not bear leaves, tends to grow downwards and is typically derived from the radicle of the embryo.

Axiom
annotated source: root development
annotated property: IAO_0000115
annotated target: The process whose specific outcome is the progression of the root over time, from its formation to the mature structure. The root is the water- and mineral-absorbing part of a plant which is usually underground, does not bear leaves, tends to grow downwards and is typically derived from the radicle of the embryo.
has db xref: GOC:jid
has db xref: PO:0009005

leaf development
type: Class
subclass of: phyllome development
IAO_0000115: The process whose specific outcome is the progression of the leaf over time, from its formation to the mature structure.

Axiom
annotated source: leaf development
annotated property: IAO_0000115
annotated target: The process whose specific outcome is the progression of the leaf over time, from its formation to the mature structure.
has db xref: GOC:go_curators

shoot system development
type: Class
subclass of: system development
IAO_0000115: The process whose specific outcome is the progression of the shoot system over time, from its formation to the mature structure.
has exact synonym: shoot development

Axiom
annotated source: shoot system development
annotated property: IAO_0000115
annotated target: The process whose specific outcome is the progression of the shoot system over time, from its formation to the mature structure.
has db xref: GOC:go_curators

floral organ development
type: Class
subclass of: developmental process involved in reproduction
subclass of: plant organ development
subclass of: Restriction
  on property: BFO_0000050
  some values from: flower development
IAO_0000115: The process whose specific outcome is the progression of the floral organ over time, from its formation to the mature structure.

Axiom
annotated source: floral organ development
annotated property: IAO_0000115
annotated target: The process whose specific outcome is the progression of the floral organ over time, from its formation to the mature structure.
has db xref: GOC:PO_curators
has db xref: GOC:go_curators
has db xref: PO:0025395

floral whorl development
type: Class
subclass of: developmental process involved in reproduction
subclass of: anatomical structure development
subclass of: Restriction
  on property: BFO_0000050
  some values from: flower development
IAO_0000115: The process whose specific outcome is the progression of a floral whorl over time, from its formation to the mature structure. A floral whorl is a circular arrangement of parts of a flower arising from a stem of a plant.
has broad synonym: collective phyllome structure development

Axiom
annotated source: floral whorl development
annotated property: IAO_0000115
annotated target: The process whose specific outcome is the progression of a floral whorl over time, from its formation to the mature structure. A floral whorl is a circular arrangement of parts of a flower arising from a stem of a plant.
has db xref: GOC:PO_curators
has db xref: GOC:dph
has db xref: GOC:go_curators
has db xref: GOC:tb
has db xref: PO:0025023

Axiom
annotated source: floral whorl development
annotated property: hasBroadSynonym
annotated target: collective phyllome structure development
has db xref: GOC:PO_curators
has db xref: PO:0025023

gynoecium development
type: Class
subclass of: floral whorl development
IAO_0000115: The process whose specific outcome is the progression of the gynoecium over time, from its formation to the mature structure. The gynoecium is the collective name for the carpels of a flower.
has exact synonym: pistil development

Axiom
annotated source: gynoecium development
annotated property: IAO_0000115
annotated target: The process whose specific outcome is the progression of the gynoecium over time, from its formation to the mature structure. The gynoecium is the collective name for the carpels of a flower.
has db xref: GOC:go_curators
has db xref: PO:0008062

positive regulation of biological process
type: Class
equivalent class: Class
  intersection of: biological regulation
  intersection of: Restriction
    on property: RO_0002213
    some values from: biological_process
subclass of: regulation of biological process
subclass of: Restriction
  on property: RO_0002213
  some values from: biological_process
IAO_0000115: Any process that activates or increases the frequency, rate or extent of a biological process. Biological processes are regulated by many means; examples include the control of gene expression, protein modification or interaction with a protein or substrate molecule.
has exact synonym: positive regulation of physiological process
has exact synonym: up regulation of biological process
has exact synonym: up-regulation of biological process
has exact synonym: upregulation of biological process
has narrow synonym: activation of biological process
has narrow synonym: stimulation of biological process

Axiom
annotated source: positive regulation of biological process
annotated property: IAO_0000115
annotated target: Any process that activates or increases the frequency, rate or extent of a biological process. Biological processes are regulated by many means; examples include the control of gene expression, protein modification or interaction with a protein or substrate molecule.
has db xref: GOC:jid

positive regulation of cellular process
type: Class
equivalent class: Class
  intersection of: biological regulation
  intersection of: Restriction
    on property: RO_0002213
    some values from: cellular process
subclass of: positive regulation of biological process
subclass of: regulation of cellular process
subclass of: Restriction
  on property: RO_0002213
  some values from: cellular process
IAO_0000115: Any process that activates or increases the frequency, rate or extent of a cellular process, any of those that are carried out at the cellular level, but are not necessarily restricted to a single cell. For example, cell communication occurs among more than one cell, but occurs at the cellular level.
has exact synonym: positive regulation of cellular physiological process
has exact synonym: up regulation of cellular process
has exact synonym: up-regulation of cellular process
has exact synonym: upregulation of cellular process
has narrow synonym: activation of cellular process
has narrow synonym: stimulation of cellular process

Axiom
annotated source: positive regulation of cellular process
annotated property: IAO_0000115
annotated target: Any process that activates or increases the frequency, rate or extent of a cellular process, any of those that are carried out at the cellular level, but are not necessarily restricted to a single cell. For example, cell communication occurs among more than one cell, but occurs at the cellular level.
has db xref: GOC:jid

regulation of post-embryonic development
type: Class
equivalent class: Class
  intersection of: biological regulation
  intersection of: Restriction
    on property: RO_0002211
    some values from: post-embryonic development
subclass of: regulation of multicellular organismal development
subclass of: Restriction
  on property: RO_0002211
  some values from: post-embryonic development
IAO_0000115: Any process that modulates the frequency, rate or extent of post-embryonic development. Post-embryonic development is defined as the process whose specific outcome is the progression of the organism over time, from the completion of embryonic development to the mature structure.

Axiom
annotated source: regulation of post-embryonic development
annotated property: IAO_0000115
annotated target: Any process that modulates the frequency, rate or extent of post-embryonic development. Post-embryonic development is defined as the process whose specific outcome is the progression of the organism over time, from the completion of embryonic development to the mature structure.
has db xref: GOC:jid

positive regulation of post-embryonic development
type: Class
equivalent class: Class
  intersection of: biological regulation
  intersection of: Restriction
    on property: RO_0002213
    some values from: post-embryonic development
subclass of: regulation of post-embryonic development
subclass of: positive regulation of developmental process
subclass of: positive regulation of multicellular organismal process
subclass of: Restriction
  on property: RO_0002213
  some values from: post-embryonic development
IAO_0000115: Any process that activates or increases the frequency, rate or extent of post-embryonic development. Post-embryonic development is defined as the process whose specific outcome is the progression of the organism over time, from the completion of embryonic development to the mature structure.
has exact synonym: up regulation of post-embryonic development
has exact synonym: up-regulation of post-embryonic development
has exact synonym: upregulation of post-embryonic development
has narrow synonym: activation of post-embryonic development
has narrow synonym: stimulation of post-embryonic development

Axiom
annotated source: positive regulation of post-embryonic development
annotated property: IAO_0000115
annotated target: Any process that activates or increases the frequency, rate or extent of post-embryonic development. Post-embryonic development is defined as the process whose specific outcome is the progression of the organism over time, from the completion of embryonic development to the mature structure.
has db xref: GOC:jid

regulation of response to stimulus
type: Class
equivalent class: Class
  intersection of: biological regulation
  intersection of: Restriction
    on property: RO_0002211
    some values from: response to stimulus
subclass of: regulation of biological process
subclass of: Restriction
  on property: RO_0002211
  some values from: response to stimulus
IAO_0000115: Any process that modulates the frequency, rate or extent of a response to a stimulus. Response to stimulus is a change in state or activity of a cell or an organism (in terms of movement, secretion, enzyme production, gene expression, etc.) as a result of a stimulus.

Axiom
annotated source: regulation of response to stimulus
annotated property: IAO_0000115
annotated target: Any process that modulates the frequency, rate or extent of a response to a stimulus. Response to stimulus is a change in state or activity of a cell or an organism (in terms of movement, secretion, enzyme production, gene expression, etc.) as a result of a stimulus.
has db xref: GOC:jid

positive regulation of response to stimulus
type: Class
equivalent class: Class
  intersection of: biological regulation
  intersection of: Restriction
    on property: RO_0002213
    some values from: response to stimulus
subclass of: positive regulation of biological process
subclass of: regulation of response to stimulus
subclass of: Restriction
  on property: RO_0002213
  some values from: response to stimulus
IAO_0000115: Any process that activates, maintains or increases the rate of a response to a stimulus. Response to stimulus is a change in state or activity of a cell or an organism (in terms of movement, secretion, enzyme production, gene expression, etc.) as a result of a stimulus.
has exact synonym: up regulation of response to stimulus
has exact synonym: up-regulation of response to stimulus
has exact synonym: upregulation of response to stimulus
has narrow synonym: activation of response to stimulus
has narrow synonym: stimulation of response to stimulus

Axiom
annotated source: positive regulation of response to stimulus
annotated property: IAO_0000115
annotated target: Any process that activates, maintains or increases the rate of a response to a stimulus. Response to stimulus is a change in state or activity of a cell or an organism (in terms of movement, secretion, enzyme production, gene expression, etc.) as a result of a stimulus.
has db xref: GOC:jid

reproductive structure development
type: Class
subclass of: developmental process involved in reproduction
subclass of: anatomical structure development
subclass of: Restriction
  on property: BFO_0000050
  some values from: reproductive system development
IAO_0000115: The reproductive developmental process whose specific outcome is the progression of somatic structures that will be used in the process of creating new individuals from one or more parents, from their formation to the mature structures.

Axiom
annotated source: reproductive structure development
annotated property: IAO_0000115
annotated target: The reproductive developmental process whose specific outcome is the progression of somatic structures that will be used in the process of creating new individuals from one or more parents, from their formation to the mature structures.
has db xref: GOC:dph
has db xref: GOC:isa_complete
has db xref: GOC:jid

system development
type: Class
subclass of: anatomical structure development
subclass of: Restriction
  on property: BFO_0000050
  some values from: multicellular organism development
IAO_0000115: The process whose specific outcome is the progression of an organismal system over time, from its formation to the mature structure. A system is a regularly interacting or interdependent group of organs or tissues that work together to carry out a given biological process.

Axiom
annotated source: system development
annotated property: IAO_0000115
annotated target: The process whose specific outcome is the progression of an organismal system over time, from its formation to the mature structure. A system is a regularly interacting or interdependent group of organs or tissues that work together to carry out a given biological process.
has db xref: GOC:dph
has db xref: GOC:jid

phyllome development
type: Class
subclass of: plant organ development
subclass of: Restriction
  on property: BFO_0000050
  some values from: shoot system development
IAO_0000115: The process whose specific outcome is the progression of a phyllome over time, from its formation to the mature structure. A phyllome is a collective term for all the different types of leaves appearing on plants.

Axiom
annotated source: phyllome development
annotated property: IAO_0000115
annotated target: The process whose specific outcome is the progression of a phyllome over time, from its formation to the mature structure. A phyllome is a collective term for all the different types of leaves appearing on plants.
has db xref: GOC:devbiol
has db xref: GOC:tb
has db xref: PO:0006001

regulation of shoot system development
type: Class
equivalent class: Class
  intersection of: biological regulation
  intersection of: Restriction
    on property: RO_0002211
    some values from: shoot system development
subclass of: regulation of developmental process
subclass of: Restriction
  on property: RO_0002211
  some values from: shoot system development
IAO_0000115: Any process that modulates the frequency, rate or extent of shoot development.
has exact synonym: regulation of shoot development

Axiom
annotated source: regulation of shoot system development
annotated property: IAO_0000115
annotated target: Any process that modulates the frequency, rate or extent of shoot development.
has db xref: GOC:tb
has db xref: PMID:16361392

anatomical structure development
type: Class
subclass of: developmental process
IAO_0000115: The biological process whose specific outcome is the progression of an anatomical structure from an initial condition to its mature state. This process begins with the formation of the structure and ends with the mature structure, whatever form that may be including its natural destruction. An anatomical structure is any biological entity that occupies space and is distinguished from its surroundings. Anatomical structures can be macroscopic such as a carpel, or microscopic such as an acrosome.
has exact synonym: development of an anatomical structure

Axiom
annotated source: anatomical structure development
annotated property: IAO_0000115
annotated target: The biological process whose specific outcome is the progression of an anatomical structure from an initial condition to its mature state. This process begins with the formation of the structure and ends with the mature structure, whatever form that may be including its natural destruction. An anatomical structure is any biological entity that occupies space and is distinguished from its surroundings. Anatomical structures can be macroscopic such as a carpel, or microscopic such as an acrosome.
has db xref: GO_REF:0000021

regulation of biological process
type: Class
equivalent class: Class
  intersection of: biological regulation
  intersection of: Restriction
    on property: RO_0002211
    some values from: biological_process
subclass of: biological regulation
subclass of: Restriction
  on property: RO_0002211
  some values from: biological_process
IAO_0000115: Any process that modulates the frequency, rate or extent of a biological process. Biological processes are regulated by many means; examples include the control of gene expression, protein modification or interaction with a protein or substrate molecule.
has exact synonym: regulation of physiological process

Axiom
annotated source: regulation of biological process
annotated property: IAO_0000115
annotated target: Any process that modulates the frequency, rate or extent of a biological process. Biological processes are regulated by many means; examples include the control of gene expression, protein modification or interaction with a protein or substrate molecule.
has db xref: GOC:ai
has db xref: GOC:go_curators

regulation of catalytic activity
type: Class
equivalent class: Class
  intersection of: biological regulation
  intersection of: Restriction
    on property: RO_0002211
    some values from: catalytic activity
subclass of: regulation of molecular function
subclass of: Restriction
  on property: RO_0002211
  some values from: catalytic activity
IAO_0000115: Any process that modulates the activity of an enzyme.
has exact synonym: regulation of enzyme activity
has narrow synonym: regulation of metalloenzyme activity

Axiom
annotated source: regulation of catalytic activity
annotated property: IAO_0000115
annotated target: Any process that modulates the activity of an enzyme.
has db xref: GOC:ai
has db xref: GOC:ebc
has db xref: GOC:vw

regulation of developmental process
type: Class
equivalent class: Class
  intersection of: biological regulation
  intersection of: Restriction
    on property: RO_0002211
    some values from: developmental process
subclass of: regulation of biological process
subclass of: Restriction
  on property: RO_0002211
  some values from: developmental process
IAO_0000115: Any process that modulates the frequency, rate or extent of development, the biological process whose specific outcome is the progression of a multicellular organism over time from an initial condition (e.g. a zygote, or a young adult) to a later condition (e.g. a multicellular animal or an aged adult).

Axiom
annotated source: regulation of developmental process
annotated property: IAO_0000115
annotated target: Any process that modulates the frequency, rate or extent of development, the biological process whose specific outcome is the progression of a multicellular organism over time from an initial condition (e.g. a zygote, or a young adult) to a later condition (e.g. a multicellular animal or an aged adult).
has db xref: GOC:go_curators

regulation of cellular process
type: Class
equivalent class: Class
  intersection of: biological regulation
  intersection of: Restriction
    on property: RO_0002211
    some values from: cellular process
subclass of: regulation of biological process
subclass of: Restriction
  on property: RO_0002211
  some values from: cellular process
IAO_0000115: Any process that modulates the frequency, rate or extent of a cellular process, any of those that are carried out at the cellular level, but are not necessarily restricted to a single cell. For example, cell communication occurs among more than one cell, but occurs at the cellular level.
has exact synonym: regulation of cellular physiological process

Axiom
annotated source: regulation of cellular process
annotated property: IAO_0000115
annotated target: Any process that modulates the frequency, rate or extent of a cellular process, any of those that are carried out at the cellular level, but are not necessarily restricted to a single cell. For example, cell communication occurs among more than one cell, but occurs at the cellular level.
has db xref: GOC:go_curators

response to stimulus
type: Class
subclass of: biological_process
IAO_0000115: Any process that results in a change in state or activity of a cell or an organism (in terms of movement, secretion, enzyme production, gene expression, etc.) as a result of a stimulus. The process begins with detection of the stimulus and ends with a change in state or activity or the cell or organism.
has exact synonym: physiological response to stimulus

Axiom
annotated source: response to stimulus
annotated property: IAO_0000115
annotated target: Any process that results in a change in state or activity of a cell or an organism (in terms of movement, secretion, enzyme production, gene expression, etc.) as a result of a stimulus. The process begins with detection of the stimulus and ends with a change in state or activity or the cell or organism.
has db xref: GOC:ai
has db xref: GOC:bf

regulation of transport
type: Class
equivalent class: Class
  intersection of: biological regulation
  intersection of: Restriction
    on property: RO_0002211
    some values from: transport
subclass of: regulation of localization
subclass of: Restriction
  on property: RO_0002211
  some values from: transport
IAO_0000115: Any process that modulates the frequency, rate or extent of the directed movement of substances (such as macromolecules, small molecules, ions) into, out of or within a cell, or between cells, by means of some agent such as a transporter or pore.

Axiom
annotated source: regulation of transport
annotated property: IAO_0000115
annotated target: Any process that modulates the frequency, rate or extent of the directed movement of substances (such as macromolecules, small molecules, ions) into, out of or within a cell, or between cells, by means of some agent such as a transporter or pore.
has db xref: GOC:ai

positive regulation of transport
type: Class
equivalent class: Class
  intersection of: biological regulation
  intersection of: Restriction
    on property: RO_0002213
    some values from: transport
subclass of: positive regulation of biological process
subclass of: regulation of transport
subclass of: Restriction
  on property: RO_0002213
  some values from: transport
IAO_0000115: Any process that activates or increases the frequency, rate or extent of the directed movement of substances (such as macromolecules, small molecules, ions) into, out of or within a cell, or between cells, by means of some agent such as a transporter or pore.
has exact synonym: up regulation of transport
has exact synonym: up-regulation of transport
has exact synonym: upregulation of transport
has narrow synonym: activation of transport
has narrow synonym: stimulation of transport

Axiom
annotated source: positive regulation of transport
annotated property: IAO_0000115
annotated target: Any process that activates or increases the frequency, rate or extent of the directed movement of substances (such as macromolecules, small molecules, ions) into, out of or within a cell, or between cells, by means of some agent such as a transporter or pore.
has db xref: GOC:ai

positive regulation of developmental process
type: Class
equivalent class: Class
  intersection of: biological regulation
  intersection of: Restriction
    on property: RO_0002213
    some values from: developmental process
subclass of: positive regulation of biological process
subclass of: regulation of developmental process
subclass of: Restriction
  on property: RO_0002213
  some values from: developmental process
IAO_0000115: Any process that activates or increases the rate or extent of development, the biological process whose specific outcome is the progression of an organism over time from an initial condition (e.g. a zygote, or a young adult) to a later condition (e.g. a multicellular animal or an aged adult).
has exact synonym: up regulation of developmental process
has exact synonym: up-regulation of developmental process
has exact synonym: upregulation of developmental process
has narrow synonym: activation of developmental process
has narrow synonym: stimulation of developmental process

Axiom
annotated source: positive regulation of developmental process
annotated property: IAO_0000115
annotated target: Any process that activates or increases the rate or extent of development, the biological process whose specific outcome is the progression of an organism over time from an initial condition (e.g. a zygote, or a young adult) to a later condition (e.g. a multicellular animal or an aged adult).
has db xref: GOC:ai

regulation of binding
type: Class
equivalent class: Class
  intersection of: biological regulation
  intersection of: Restriction
    on property: RO_0002211
    some values from: binding
subclass of: regulation of molecular function
subclass of: Restriction
  on property: RO_0002211
  some values from: binding
IAO_0000115: Any process that modulates the frequency, rate or extent of binding, the selective interaction of a molecule with one or more specific sites on another molecule.

Axiom
annotated source: regulation of binding
annotated property: IAO_0000115
annotated target: Any process that modulates the frequency, rate or extent of binding, the selective interaction of a molecule with one or more specific sites on another molecule.
has db xref: GOC:ai

positive regulation of binding
type: Class
equivalent class: Class
  intersection of: biological regulation
  intersection of: Restriction
    on property: RO_0002213
    some values from: binding
subclass of: positive regulation of molecular function
subclass of: regulation of binding
subclass of: Restriction
  on property: RO_0002213
  some values from: binding
IAO_0000115: Any process that activates or increases the rate or extent of binding, the selective interaction of a molecule with one or more specific sites on another molecule.
has exact synonym: up regulation of binding
has exact synonym: up-regulation of binding
has exact synonym: upregulation of binding
has narrow synonym: activation of binding
has narrow synonym: stimulation of binding

Axiom
annotated source: positive regulation of binding
annotated property: IAO_0000115
annotated target: Any process that activates or increases the rate or extent of binding, the selective interaction of a molecule with one or more specific sites on another molecule.
has db xref: GOC:ai

regulation of cellular component organization
type: Class
equivalent class: Class
  intersection of: biological regulation
  intersection of: Restriction
    on property: RO_0002211
    some values from: cellular component organization
subclass of: regulation of cellular process
subclass of: Restriction
  on property: RO_0002211
  some values from: cellular component organization
IAO_0000115: Any process that modulates the frequency, rate or extent of a process involved in the formation, arrangement of constituent parts, or disassembly of cell structures, including the plasma membrane and any external encapsulating structures such as the cell wall and cell envelope.
has exact synonym: regulation of cellular component organisation
has related synonym: regulation of cell organisation
has related synonym: regulation of cell organization
has related synonym: regulation of cellular component organization and biogenesis

Axiom
annotated source: regulation of cellular component organization
annotated property: IAO_0000115
annotated target: Any process that modulates the frequency, rate or extent of a process involved in the formation, arrangement of constituent parts, or disassembly of cell structures, including the plasma membrane and any external encapsulating structures such as the cell wall and cell envelope.
has db xref: GOC:ai

Axiom
annotated source: regulation of cellular component organization
annotated property: hasRelatedSynonym
annotated target: regulation of cell organisation
has db xref: GOC:mah

Axiom
annotated source: regulation of cellular component organization
annotated property: hasRelatedSynonym
annotated target: regulation of cell organization
has db xref: GOC:mah

Axiom
annotated source: regulation of cellular component organization
annotated property: hasRelatedSynonym
annotated target: regulation of cellular component organization and biogenesis
has db xref: GOC:mah

positive regulation of cellular component organization
type: Class
equivalent class: Class
  intersection of: biological regulation
  intersection of: Restriction
    on property: RO_0002213
    some values from: cellular component organization
subclass of: positive regulation of cellular process
subclass of: regulation of cellular component organization
subclass of: Restriction
  on property: RO_0002213
  some values from: cellular component organization
IAO_0000115: Any process that activates or increases the frequency, rate or extent of a process involved in the formation, arrangement of constituent parts, or disassembly of cell structures, including the plasma membrane and any external encapsulating structures such as the cell wall and cell envelope.
has exact synonym: positive regulation of cell organisation
has exact synonym: up regulation of cell organization
has exact synonym: up-regulation of cell organization
has exact synonym: upregulation of cell organization
has narrow synonym: activation of cell organization
has narrow synonym: stimulation of cell organization
has related synonym: positive regulation of cellular component organization and biogenesis

Axiom
annotated source: positive regulation of cellular component organization
annotated property: IAO_0000115
annotated target: Any process that activates or increases the frequency, rate or extent of a process involved in the formation, arrangement of constituent parts, or disassembly of cell structures, including the plasma membrane and any external encapsulating structures such as the cell wall and cell envelope.
has db xref: GOC:ai

Axiom
annotated source: positive regulation of cellular component organization
annotated property: hasRelatedSynonym
annotated target: positive regulation of cellular component organization and biogenesis
has db xref: GOC:mah

regulation of phosphorus metabolic process
type: Class
equivalent class: Class
  intersection of: biological regulation
  intersection of: Restriction
    on property: RO_0002211
    some values from: phosphorus metabolic process
subclass of: regulation of cellular metabolic process
subclass of: Restriction
  on property: RO_0002211
  some values from: phosphorus metabolic process
IAO_0000115: Any process that modulates the frequency, rate or extent of the chemical reactions and pathways involving phosphorus or compounds containing phosphorus.
has exact synonym: regulation of phosphorus metabolism

Axiom
annotated source: regulation of phosphorus metabolic process
annotated property: IAO_0000115
annotated target: Any process that modulates the frequency, rate or extent of the chemical reactions and pathways involving phosphorus or compounds containing phosphorus.
has db xref: GOC:ai

localization
type: Class
subclass of: biological_process
IAO_0000115: Any process in which a cell, a substance, or a cellular entity, such as a protein complex or organelle, is transported, tethered to or otherwise maintained in a specific location. In the case of substances, localization may also be achieved via selective degradation.
has exact synonym: establishment and maintenance of localization
has exact synonym: establishment and maintenance of position
has exact synonym: localisation
has narrow synonym: establishment and maintenance of cellular component location
has narrow synonym: establishment and maintenance of substance location
has narrow synonym: establishment and maintenance of substrate location
has related synonym: single organism localization
has related synonym: single-organism localization

Axiom
annotated source: localization
annotated property: IAO_0000115
annotated target: Any process in which a cell, a substance, or a cellular entity, such as a protein complex or organelle, is transported, tethered to or otherwise maintained in a specific location. In the case of substances, localization may also be achieved via selective degradation.
has db xref: GOC:ai
has db xref: GOC:dos

Axiom
annotated source: localization
annotated property: hasExactSynonym
annotated target: localisation
has db xref: GOC:mah

Axiom
annotated source: localization
annotated property: hasRelatedSynonym
annotated target: single organism localization
has db xref: GOC:TermGenie

establishment of localization
type: Class
subclass of: localization
IAO_0000115: Any process that localizes a substance or cellular component. This may occur via movement, tethering or selective degradation.
has exact synonym: establishment of localisation

Axiom
annotated source: establishment of localization
annotated property: IAO_0000115
annotated target: Any process that localizes a substance or cellular component. This may occur via movement, tethering or selective degradation.
has db xref: GOC:ai
has db xref: GOC:dos

Axiom
annotated source: establishment of localization
annotated property: hasExactSynonym
annotated target: establishment of localisation
has db xref: GOC:mah

regulation of multicellular organismal process
type: Class
equivalent class: Class
  intersection of: biological regulation
  intersection of: Restriction
    on property: RO_0002211
    some values from: multicellular organismal process
subclass of: regulation of biological process
subclass of: Restriction
  on property: RO_0002211
  some values from: multicellular organismal process
IAO_0000115: Any process that modulates the frequency, rate or extent of a multicellular organismal process, the processes pertinent to the function of a multicellular organism above the cellular level; includes the integrated processes of tissues and organs.

Axiom
annotated source: regulation of multicellular organismal process
annotated property: IAO_0000115
annotated target: Any process that modulates the frequency, rate or extent of a multicellular organismal process, the processes pertinent to the function of a multicellular organism above the cellular level; includes the integrated processes of tissues and organs.
has db xref: GOC:ai
has db xref: GOC:dph
has db xref: GOC:tb

positive regulation of multicellular organismal process
type: Class
equivalent class: Class
  intersection of: biological regulation
  intersection of: Restriction
    on property: RO_0002213
    some values from: multicellular organismal process
subclass of: positive regulation of biological process
subclass of: regulation of multicellular organismal process
subclass of: Restriction
  on property: RO_0002213
  some values from: multicellular organismal process
IAO_0000115: Any process that activates or increases the frequency, rate or extent of an organismal process, any of the processes pertinent to the function of an organism above the cellular level; includes the integrated processes of tissues and organs.
has exact synonym: up regulation of multicellular organismal process
has exact synonym: up-regulation of multicellular organismal process
has exact synonym: upregulation of multicellular organismal process
has narrow synonym: activation of multicellular organismal process
has narrow synonym: stimulation of multicellular organismal process

Axiom
annotated source: positive regulation of multicellular organismal process
annotated property: IAO_0000115
annotated target: Any process that activates or increases the frequency, rate or extent of an organismal process, any of the processes pertinent to the function of an organism above the cellular level; includes the integrated processes of tissues and organs.
has db xref: GOC:ai

meiotic cell cycle
type: Class
equivalent class: Class
  intersection of: cell cycle
  intersection of: Restriction
    on property: BFO_0000051
    some values from: meiotic nuclear division
subclass of: cell cycle
subclass of: reproductive process
subclass of: Restriction
  on property: BFO_0000050
  some values from: sexual reproduction
subclass of: Restriction
  on property: BFO_0000051
  some values from: meiotic nuclear division
IAO_0000115: Progression through the phases of the meiotic cell cycle, in which canonically a cell replicates to produce four offspring with half the chromosomal content of the progenitor cell via two nuclear divisions.
has related synonym: meiosis

Axiom
annotated source: meiotic cell cycle
annotated property: IAO_0000115
annotated target: Progression through the phases of the meiotic cell cycle, in which canonically a cell replicates to produce four offspring with half the chromosomal content of the progenitor cell via two nuclear divisions.
has db xref: GOC:ai

regulation of hydrolase activity
type: Class
equivalent class: Class
  intersection of: biological regulation
  intersection of: Restriction
    on property: RO_0002211
    some values from: hydrolase activity
subclass of: regulation of catalytic activity
subclass of: Restriction
  on property: RO_0002211
  some values from: hydrolase activity
IAO_0000115: Any process that modulates the frequency, rate or extent of hydrolase activity, the catalysis of the hydrolysis of various bonds, e.g. C-O, C-N, C-C, phosphoric anhydride bonds, etc. Hydrolase is the systematic name for any enzyme of EC class 3.
has exact synonym: hydrolase regulator

Axiom
annotated source: regulation of hydrolase activity
annotated property: IAO_0000115
annotated target: Any process that modulates the frequency, rate or extent of hydrolase activity, the catalysis of the hydrolysis of various bonds, e.g. C-O, C-N, C-C, phosphoric anhydride bonds, etc. Hydrolase is the systematic name for any enzyme of EC class 3.
has db xref: GOC:ai

regulation of transferase activity
type: Class
equivalent class: Class
  intersection of: biological regulation
  intersection of: Restriction
    on property: RO_0002211
    some values from: transferase activity
subclass of: regulation of catalytic activity
subclass of: Restriction
  on property: RO_0002211
  some values from: transferase activity
IAO_0000115: Any process that modulates the frequency, rate or extent of transferase activity, the catalysis of the transfer of a group, e.g. a methyl group, glycosyl group, acyl group, phosphorus-containing, or other groups, from one compound (generally regarded as the donor) to another compound (generally regarded as the acceptor). Transferase is the systematic name for any enzyme of EC class 2.
has exact synonym: transferase regulator

Axiom
annotated source: regulation of transferase activity
annotated property: IAO_0000115
annotated target: Any process that modulates the frequency, rate or extent of transferase activity, the catalysis of the transfer of a group, e.g. a methyl group, glycosyl group, acyl group, phosphorus-containing, or other groups, from one compound (generally regarded as the donor) to another compound (generally regarded as the acceptor). Transferase is the systematic name for any enzyme of EC class 2.
has db xref: GOC:ai

positive regulation of hydrolase activity
type: Class
equivalent class: Class
  intersection of: biological regulation
  intersection of: Restriction
    on property: RO_0002213
    some values from: hydrolase activity
subclass of: positive regulation of catalytic activity
subclass of: regulation of hydrolase activity
subclass of: Restriction
  on property: RO_0002213
  some values from: hydrolase activity
IAO_0000115: Any process that activates or increases the frequency, rate or extent of hydrolase activity, the catalysis of the hydrolysis of various bonds.
has exact synonym: hydrolase activator
has exact synonym: up regulation of hydrolase activity
has exact synonym: up-regulation of hydrolase activity
has exact synonym: upregulation of hydrolase activity
has narrow synonym: activation of hydrolase activity
has narrow synonym: stimulation of hydrolase activity

Axiom
annotated source: positive regulation of hydrolase activity
annotated property: IAO_0000115
annotated target: Any process that activates or increases the frequency, rate or extent of hydrolase activity, the catalysis of the hydrolysis of various bonds.
has db xref: GOC:ai

positive regulation of transferase activity
type: Class
equivalent class: Class
  intersection of: biological regulation
  intersection of: Restriction
    on property: RO_0002213
    some values from: transferase activity
subclass of: positive regulation of catalytic activity
subclass of: regulation of transferase activity
subclass of: Restriction
  on property: RO_0002213
  some values from: transferase activity
IAO_0000115: Any process that activates or increases the frequency, rate or extent of transferase activity, the catalysis of the transfer of a group, e.g. a methyl group, glycosyl group, acyl group, phosphorus-containing, or other groups, from a donor compound to an acceptor.
has exact synonym: transferase activator
has exact synonym: up regulation of transferase activity
has exact synonym: up-regulation of transferase activity
has exact synonym: upregulation of transferase activity
has narrow synonym: activation of transferase activity
has narrow synonym: stimulation of transferase activity

Axiom
annotated source: positive regulation of transferase activity
annotated property: IAO_0000115
annotated target: Any process that activates or increases the frequency, rate or extent of transferase activity, the catalysis of the transfer of a group, e.g. a methyl group, glycosyl group, acyl group, phosphorus-containing, or other groups, from a donor compound to an acceptor.
has db xref: GOC:ai

regulation of meiotic cell cycle
type: Class
equivalent class: Class
  intersection of: biological regulation
  intersection of: Restriction
    on property: RO_0002211
    some values from: meiotic cell cycle
subclass of: regulation of cell cycle
subclass of: regulation of reproductive process
subclass of: Restriction
  on property: RO_0002211
  some values from: meiotic cell cycle
IAO_0000115: Any process that modulates the rate or extent of progression through the meiotic cell cycle.
has exact synonym: meiotic cell cycle modulation
has exact synonym: meiotic cell cycle regulation
has exact synonym: modulation of meiotic cell cycle progression
has exact synonym: regulation of meiotic cell cycle progression
has exact synonym: regulation of progression through meiotic cell cycle
has related synonym: meiotic cell cycle regulator

Axiom
annotated source: regulation of meiotic cell cycle
annotated property: IAO_0000115
annotated target: Any process that modulates the rate or extent of progression through the meiotic cell cycle.
has db xref: GOC:ai
has db xref: GOC:dph
has db xref: GOC:tb

Axiom
annotated source: regulation of meiotic cell cycle
annotated property: hasExactSynonym
annotated target: regulation of progression through meiotic cell cycle
has db xref: GOC:dph
has db xref: GOC:tb

positive regulation of meiotic cell cycle
type: Class
equivalent class: Class
  intersection of: biological regulation
  intersection of: Restriction
    on property: RO_0002213
    some values from: meiotic cell cycle
subclass of: positive regulation of cell cycle
subclass of: regulation of meiotic cell cycle
subclass of: positive regulation of reproductive process
subclass of: Restriction
  on property: RO_0002213
  some values from: meiotic cell cycle
IAO_0000115: Any process that activates or increases the frequency, rate or extent of progression through the meiotic cell cycle.
has exact synonym: positive regulation of meiotic cell cycle progression
has exact synonym: positive regulation of progression through meiotic cell cycle
has exact synonym: up regulation of progression through meiotic cell cycle
has exact synonym: up-regulation of progression through meiotic cell cycle
has exact synonym: upregulation of progression through meiotic cell cycle
has narrow synonym: activation of progression through meiotic cell cycle
has narrow synonym: stimulation of progression through meiotic cell cycle

Axiom
annotated source: positive regulation of meiotic cell cycle
annotated property: IAO_0000115
annotated target: Any process that activates or increases the frequency, rate or extent of progression through the meiotic cell cycle.
has db xref: GOC:ai
has db xref: GOC:dph
has db xref: GOC:tb

Axiom
annotated source: positive regulation of meiotic cell cycle
annotated property: hasExactSynonym
annotated target: positive regulation of progression through meiotic cell cycle
has db xref: GOC:dph
has db xref: GOC:tb

cellular response to stimulus
type: Class
subclass of: cellular process
subclass of: response to stimulus
IAO_0000115: Any process that results in a change in state or activity of a cell (in terms of movement, secretion, enzyme production, gene expression, etc.) as a result of a stimulus. The process begins with detection of the stimulus by a cell and ends with a change in state or activity or the cell.

Axiom
annotated source: cellular response to stimulus
annotated property: IAO_0000115
annotated target: Any process that results in a change in state or activity of a cell (in terms of movement, secretion, enzyme production, gene expression, etc.) as a result of a stimulus. The process begins with detection of the stimulus by a cell and ends with a change in state or activity or the cell.
has db xref: GOC:bf
has db xref: GOC:jl

regulation of cell cycle
type: Class
equivalent class: Class
  intersection of: biological regulation
  intersection of: Restriction
    on property: RO_0002211
    some values from: cell cycle
subclass of: regulation of cellular process
subclass of: Restriction
  on property: RO_0002211
  some values from: cell cycle
IAO_0000115: Any process that modulates the rate or extent of progression through the cell cycle.
has exact synonym: cell cycle modulation
has exact synonym: cell cycle regulation
has exact synonym: control of cell cycle progression
has exact synonym: modulation of cell cycle progression
has exact synonym: regulation of cell cycle progression
has exact synonym: regulation of progression through cell cycle
has narrow synonym: arrest of mitotic cell cycle progression
has narrow synonym: cell cycle arrest
has narrow synonym: mitotic cell cycle arrest
has narrow synonym: negative regulation of cell cycle arrest
has narrow synonym: positive regulation of cell cycle arrest
has narrow synonym: regulation of cell cycle arrest
has related synonym: cell cycle regulator
has related synonym: tumor suppressor

Axiom
annotated source: regulation of cell cycle
annotated property: IAO_0000115
annotated target: Any process that modulates the rate or extent of progression through the cell cycle.
has db xref: GOC:ai
has db xref: GOC:dph
has db xref: GOC:tb

Axiom
annotated source: regulation of cell cycle
annotated property: hasNarrowSynonym
annotated target: arrest of mitotic cell cycle progression
has db xref: GOC:mah

regulation of nuclear division
type: Class
equivalent class: Class
  intersection of: biological regulation
  intersection of: Restriction
    on property: RO_0002211
    some values from: nuclear division
subclass of: regulation of organelle organization
subclass of: Restriction
  on property: RO_0002211
  some values from: nuclear division
IAO_0000115: Any process that modulates the frequency, rate or extent of nuclear division, the partitioning of the nucleus and its genetic information.

Axiom
annotated source: regulation of nuclear division
annotated property: IAO_0000115
annotated target: Any process that modulates the frequency, rate or extent of nuclear division, the partitioning of the nucleus and its genetic information.
has db xref: GOC:ai

positive regulation of nuclear division
type: Class
equivalent class: Class
  intersection of: biological regulation
  intersection of: Restriction
    on property: RO_0002213
    some values from: nuclear division
subclass of: positive regulation of organelle organization
subclass of: regulation of nuclear division
subclass of: Restriction
  on property: RO_0002213
  some values from: nuclear division
IAO_0000115: Any process that activates or increases the frequency, rate or extent of nuclear division, the partitioning of the nucleus and its genetic information.
has exact synonym: up regulation of nuclear division
has exact synonym: up-regulation of nuclear division
has exact synonym: upregulation of nuclear division
has narrow synonym: activation of nuclear division
has narrow synonym: stimulation of nuclear division

Axiom
annotated source: positive regulation of nuclear division
annotated property: IAO_0000115
annotated target: Any process that activates or increases the frequency, rate or extent of nuclear division, the partitioning of the nucleus and its genetic information.
has db xref: GOC:ai

beta-glucanase activity
type: Class
subclass of: hydrolase activity, hydrolyzing O-glycosyl compounds
IAO_0000115: Catalysis of the hydrolysis of linkages in beta-D-glucans; beta-glucans are polysaccharides of D-glucose monomers linked by beta-glycosidic bonds.
has exact synonym: beta-D-glucanase activity

Axiom
annotated source: beta-glucanase activity
annotated property: IAO_0000115
annotated target: Catalysis of the hydrolysis of linkages in beta-D-glucans; beta-glucans are polysaccharides of D-glucose monomers linked by beta-glycosidic bonds.
has db xref: Wikipedia:Beta-glucan

molecular transducer activity
type: Class
subclass of: molecular_function
IAO_0000115: A compound molecular function in which an effector function is controlled by one or more regulatory components.

Axiom
annotated source: molecular transducer activity
annotated property: IAO_0000115
annotated target: A compound molecular function in which an effector function is controlled by one or more regulatory components.
has db xref: GOC:dos
has db xref: GOC:pdt

reproductive system development
type: Class
subclass of: system development
IAO_0000115: The progression of the reproductive system over time from its formation to the mature structure. The reproductive system consists of the organs that function in reproduction.

Axiom
annotated source: reproductive system development
annotated property: IAO_0000115
annotated target: The progression of the reproductive system over time from its formation to the mature structure. The reproductive system consists of the organs that function in reproduction.
has db xref: GOC:dph

biological regulation
type: Class
subclass of: biological_process
IAO_0000115: Any process that modulates a measurable attribute of any biological process, quality or function.
has broad synonym: regulation

Axiom
annotated source: biological regulation
annotated property: IAO_0000115
annotated target: Any process that modulates a measurable attribute of any biological process, quality or function.
has db xref: GOC:dph
has db xref: GOC:isa_complete
has db xref: GOC:mah
has db xref: GOC:pr
has db xref: GOC:vw

regulation of molecular function
type: Class
equivalent class: Class
  intersection of: biological regulation
  intersection of: Restriction
    on property: RO_0002211
    some values from: molecular_function
subclass of: biological regulation
subclass of: Restriction
  on property: RO_0002211
  some values from: molecular_function
IAO_0000115: Any process that modulates the frequency, rate or extent of a molecular function, an elemental biological activity occurring at the molecular level, such as catalysis or binding.
has exact synonym: regulation of a molecular function

Axiom
annotated source: regulation of molecular function
annotated property: IAO_0000115
annotated target: Any process that modulates the frequency, rate or extent of a molecular function, an elemental biological activity occurring at the molecular level, such as catalysis or binding.
has db xref: GOC:isa_complete

adenylyltransferase activity
type: Class
subclass of: nucleotidyltransferase activity
IAO_0000115: Catalysis of the transfer of an adenylyl group to an acceptor.

Axiom
annotated source: adenylyltransferase activity
annotated property: IAO_0000115
annotated target: Catalysis of the transfer of an adenylyl group to an acceptor.
has db xref: GOC:mah

anatomical structure maturation
type: Class
subclass of: developmental maturation
subclass of: Restriction
  on property: BFO_0000050
  some values from: anatomical structure development
IAO_0000115: A developmental process, independent of morphogenetic (shape) change, that is required for an anatomical structure to attain its fully functional state.

Axiom
annotated source: anatomical structure maturation
annotated property: IAO_0000115
annotated target: A developmental process, independent of morphogenetic (shape) change, that is required for an anatomical structure to attain its fully functional state.
has db xref: GOC:mah

organic substance transport
type: Class
subclass of: transport
IAO_0000115: The directed movement of organic substances into, out of or within a cell, or between cells, or within a multicellular organism by means of some agent such as a transporter or pore. An organic substance is a molecular entity that contains carbon.

Axiom
annotated source: organic substance transport
annotated property: IAO_0000115
annotated target: The directed movement of organic substances into, out of or within a cell, or between cells, or within a multicellular organism by means of some agent such as a transporter or pore. An organic substance is a molecular entity that contains carbon.
has db xref: GOC:mah

organic substance metabolic process
type: Class
subclass of: metabolic process
IAO_0000115: The chemical reactions and pathways involving an organic substance, any molecular entity containing carbon.
has exact synonym: organic molecular entity metabolic process
has exact synonym: organic molecular entity metabolism
has exact synonym: organic substance metabolism

Axiom
annotated source: organic substance metabolic process
annotated property: IAO_0000115
annotated target: The chemical reactions and pathways involving an organic substance, any molecular entity containing carbon.
has db xref: GOC:mah

cellular component organization or biogenesis
type: Class
subclass of: cellular process
IAO_0000115: A process that results in the biosynthesis of constituent macromolecules, assembly, arrangement of constituent parts, or disassembly of a cellular component.
has exact synonym: cellular component organisation or biogenesis
has exact synonym: cellular component organisation or biogenesis at cellular level
has exact synonym: cellular component organization or biogenesis at cellular level

Axiom
annotated source: cellular component organization or biogenesis
annotated property: IAO_0000115
annotated target: A process that results in the biosynthesis of constituent macromolecules, assembly, arrangement of constituent parts, or disassembly of a cellular component.
has db xref: GOC:mah

Axiom
annotated source: cellular component organization or biogenesis
annotated property: hasExactSynonym
annotated target: cellular component organisation or biogenesis
has db xref: GOC:mah

Axiom
annotated source: cellular component organization or biogenesis
annotated property: hasExactSynonym
annotated target: cellular component organisation or biogenesis at cellular level
has db xref: GOC:mah

cell periphery
type: Class
subclass of: cellular anatomical entity
IAO_0000115: The broad region around and including the plasma membrane of a cell, encompassing the cell cortex (inside the cell), the plasma membrane, and any external encapsulating structures.

Axiom
annotated source: cell periphery
annotated property: IAO_0000115
annotated target: The broad region around and including the plasma membrane of a cell, encompassing the cell cortex (inside the cell), the plasma membrane, and any external encapsulating structures.
has db xref: GOC:pdt

regulation of response to stress
type: Class
equivalent class: Class
  intersection of: biological regulation
  intersection of: Restriction
    on property: RO_0002211
    some values from: response to stress
subclass of: regulation of response to stimulus
subclass of: Restriction
  on property: RO_0002211
  some values from: response to stress
IAO_0000115: Any process that modulates the frequency, rate or extent of a response to stress. Response to stress is a change in state or activity of a cell or an organism (in terms of movement, secretion, enzyme production, gene expression, etc.) as a result of a disturbance in organismal or cellular homeostasis, usually, but not necessarily, exogenous (e.g. temperature, humidity, ionizing radiation).

Axiom
annotated source: regulation of response to stress
annotated property: IAO_0000115
annotated target: Any process that modulates the frequency, rate or extent of a response to stress. Response to stress is a change in state or activity of a cell or an organism (in terms of movement, secretion, enzyme production, gene expression, etc.) as a result of a disturbance in organismal or cellular homeostasis, usually, but not necessarily, exogenous (e.g. temperature, humidity, ionizing radiation).
has db xref: GOC:dhl

positive regulation of cell cycle process
type: Class
equivalent class: Class
  intersection of: biological regulation
  intersection of: Restriction
    on property: RO_0002213
    some values from: cell cycle process
subclass of: regulation of cell cycle process
subclass of: positive regulation of cell cycle
subclass of: Restriction
  on property: RO_0002213
  some values from: cell cycle process
IAO_0000115: Any process that increases the rate, frequency or extent of a cellular process that is involved in the progression of biochemical and morphological phases and events that occur in a cell during successive cell replication or nuclear replication events.

Axiom
annotated source: positive regulation of cell cycle process
annotated property: IAO_0000115
annotated target: Any process that increases the rate, frequency or extent of a cellular process that is involved in the progression of biochemical and morphological phases and events that occur in a cell during successive cell replication or nuclear replication events.
has db xref: GOC:dph
has db xref: GOC:tb

stomatal closure
type: Class
subclass of: stomatal movement
IAO_0000115: The process of closing of stomata, pores in the epidermis of leaves and stems bordered by two guard cells and serving in gas exchange.

Axiom
annotated source: stomatal closure
annotated property: IAO_0000115
annotated target: The process of closing of stomata, pores in the epidermis of leaves and stems bordered by two guard cells and serving in gas exchange.
has db xref: GOC:tb

reproductive shoot system development
type: Class
subclass of: post-embryonic development
subclass of: shoot system development
subclass of: reproductive structure development
IAO_0000115: The process whose specific outcome is the progression of a reproductive shoot system over time, from its formation to the mature structure.

Axiom
annotated source: reproductive shoot system development
annotated property: IAO_0000115
annotated target: The process whose specific outcome is the progression of a reproductive shoot system over time, from its formation to the mature structure.
has db xref: GOC:pj

plant organ senescence
type: Class
subclass of: developmental process
subclass of: Restriction
  on property: BFO_0000050
  some values from: plant organ development
IAO_0000115: A plant organ developmental process during which a plant dismantles cellular components to reclaim the cellular building blocks and nutrients that have been deposited in the plant organs during growth.

Axiom
annotated source: plant organ senescence
annotated property: IAO_0000115
annotated target: A plant organ developmental process during which a plant dismantles cellular components to reclaim the cellular building blocks and nutrients that have been deposited in the plant organs during growth.
has db xref: GOC:tb
has db xref: PMID:17177638
has db xref: PMID:34938309

plasma membrane region
type: Class
equivalent class: Class
  intersection of: membrane
  intersection of: Restriction
    on property: BFO_0000050
    some values from: plasma membrane
subclass of: membrane
subclass of: Restriction
  on property: BFO_0000050
  some values from: plasma membrane
IAO_0000115: A membrane that is a (regional) part of the plasma membrane.
has exact synonym: region of plasma membrane

Axiom
annotated source: plasma membrane region
annotated property: IAO_0000115
annotated target: A membrane that is a (regional) part of the plasma membrane.
has db xref: GOC:dos

molecular function regulator activity
type: Class
subclass of: molecular_function
subclass of: Restriction
  on property: BFO_0000051
  some values from: protein binding
IAO_0000115: A molecular function regulator regulates the activity of its target via non-covalent binding that does not result in covalent modification to the target. Examples of molecular function regulators include regulatory subunits of multimeric enzymes and channels. Mechanisms of regulation include allosteric changes in the target and competitive inhibition.
has exact synonym: molecular function regulator

Axiom
annotated source: molecular function regulator activity
annotated property: IAO_0000115
annotated target: A molecular function regulator regulates the activity of its target via non-covalent binding that does not result in covalent modification to the target. Examples of molecular function regulators include regulatory subunits of multimeric enzymes and channels. Mechanisms of regulation include allosteric changes in the target and competitive inhibition.
has db xref: GOC:dos
has db xref: GOC:pt

plant organ development
type: Class
subclass of: anatomical structure development
subclass of: Restriction
  on property: BFO_0000050
  some values from: system development
IAO_0000115: Development of a plant organ, a multi-tissue plant structure that forms a functional unit.
has exact synonym: development of a plant organ

Axiom
annotated source: plant organ development
annotated property: IAO_0000115
annotated target: Development of a plant organ, a multi-tissue plant structure that forms a functional unit.
has db xref: GOC:dos

cytoplasmic region
type: Class
equivalent class: Class
  intersection of: cytoplasm
  intersection of: Restriction
    on property: BFO_0000050
    some values from: cytoplasm
subclass of: cytoplasm
subclass of: Restriction
  on property: BFO_0000050
  some values from: cytoplasm
IAO_0000115: Any (proper) part of the cytoplasm of a single cell of sufficient size to still be considered cytoplasm.

Axiom
annotated source: cytoplasmic region
annotated property: IAO_0000115
annotated target: Any (proper) part of the cytoplasm of a single cell of sufficient size to still be considered cytoplasm.
has db xref: GOC:dos

cell cortex region
type: Class
equivalent class: Class
  intersection of: cell cortex
  intersection of: Restriction
    on property: BFO_0000050
    some values from: cell cortex
subclass of: cell cortex
subclass of: cytoplasmic region
subclass of: Restriction
  on property: BFO_0000050
  some values from: cell cortex
IAO_0000115: The complete extent of cell cortex that underlies some some region of the plasma membrane.
has exact synonym: perimembrane region

Axiom
annotated source: cell cortex region
annotated property: IAO_0000115
annotated target: The complete extent of cell cortex that underlies some some region of the plasma membrane.
has db xref: GOC:dos

cellular anatomical entity
type: Class
subclass of: cellular_component
IAO_0000115: A part of a cellular organism that is either an immaterial entity or a material entity with granularity above the level of a protein complex but below that of an anatomical system. Or, a substance produced by a cellular organism with granularity above the level of a protein complex.

Axiom
annotated source: cellular anatomical entity
annotated property: IAO_0000115
annotated target: A part of a cellular organism that is either an immaterial entity or a material entity with granularity above the level of a protein complex but below that of an anatomical system. Or, a substance produced by a cellular organism with granularity above the level of a protein complex.
has db xref: GOC:kmv

plasma membrane bounded cell projection
type: Class
equivalent class: Class
  intersection of: cell projection
  intersection of: Restriction
    on property: BFO_0000051
    some values from: plasma membrane region
subclass of: cell projection
subclass of: Restriction
  on property: BFO_0000051
  some values from: plasma membrane region
IAO_0000115: A prolongation or process extending from a cell and that is bounded by plasma membrane, e.g. a cilium, lamellipodium, or axon.

Axiom
annotated source: plasma membrane bounded cell projection
annotated property: IAO_0000115
annotated target: A prolongation or process extending from a cell and that is bounded by plasma membrane, e.g. a cilium, lamellipodium, or axon.
has db xref: GOC:krc

meiotic nuclear division
type: Class
equivalent class: Class
  intersection of: nuclear division
  intersection of: Restriction
    on property: BFO_0000050
    some values from: meiotic cell cycle
subclass of: nuclear division
subclass of: meiotic cell cycle process
IAO_0000115: One of the two nuclear divisions that occur as part of the meiotic cell cycle.
has exact synonym: meiosis

Axiom
annotated source: meiotic nuclear division
annotated property: IAO_0000115
annotated target: One of the two nuclear divisions that occur as part of the meiotic cell cycle.
has db xref: PMID:9334324

mitotic nuclear division
type: Class
equivalent class: Class
  intersection of: nuclear division
  intersection of: Restriction
    on property: BFO_0000050
    some values from: mitotic cell cycle
subclass of: nuclear division
subclass of: mitotic cell cycle process
IAO_0000115: A mitotic cell cycle process comprising the steps by which the nucleus of a eukaryotic cell divides; the process involves condensation of chromosomal DNA into a highly compacted form. Canonically, mitosis produces two daughter nuclei whose chromosome complement is identical to that of the mother cell.
has exact synonym: mitosis

Axiom
annotated source: mitotic nuclear division
annotated property: IAO_0000115
annotated target: A mitotic cell cycle process comprising the steps by which the nucleus of a eukaryotic cell divides; the process involves condensation of chromosomal DNA into a highly compacted form. Canonically, mitosis produces two daughter nuclei whose chromosome complement is identical to that of the mother cell.
has db xref: ISBN:0198547684

molecular function activator activity
type: Class
subclass of: molecular function regulator activity
IAO_0000115: A molecular function regulator that activates or increases the activity of its target via non-covalent binding that does not result in covalent modification to the target.

Axiom
annotated source: molecular function activator activity
annotated property: IAO_0000115
annotated target: A molecular function regulator that activates or increases the activity of its target via non-covalent binding that does not result in covalent modification to the target.
has db xref: GOC:curators

regulation of leaf senescence
type: Class
equivalent class: Class
  intersection of: biological regulation
  intersection of: Restriction
    on property: RO_0002211
    some values from: leaf senescence
subclass of: regulation of developmental process
subclass of: Restriction
  on property: RO_0002211
  some values from: leaf senescence
IAO_0000115: Any process that modulates the frequency, rate or extent of leaf senescence.

Axiom
annotated source: regulation of leaf senescence
annotated property: IAO_0000115
annotated target: Any process that modulates the frequency, rate or extent of leaf senescence.
has db xref: GOC:TermGenie

positive regulation of leaf senescence
type: Class
equivalent class: Class
  intersection of: biological regulation
  intersection of: Restriction
    on property: RO_0002213
    some values from: leaf senescence
subclass of: positive regulation of developmental process
subclass of: regulation of leaf senescence
subclass of: Restriction
  on property: RO_0002213
  some values from: leaf senescence
IAO_0000115: Any process that activates or increases the frequency, rate or extent of leaf senescence.
has related synonym: activation of leaf senescence
has related synonym: up regulation of leaf senescence
has related synonym: up-regulation of leaf senescence
has related synonym: upregulation of leaf senescence

Axiom
annotated source: positive regulation of leaf senescence
annotated property: IAO_0000115
annotated target: Any process that activates or increases the frequency, rate or extent of leaf senescence.
has db xref: GOC:TermGenie

Axiom
annotated source: positive regulation of leaf senescence
annotated property: hasRelatedSynonym
annotated target: activation of leaf senescence
has db xref: GOC:TermGenie

Axiom
annotated source: positive regulation of leaf senescence
annotated property: hasRelatedSynonym
annotated target: up regulation of leaf senescence
has db xref: GOC:TermGenie

Axiom
annotated source: positive regulation of leaf senescence
annotated property: hasRelatedSynonym
annotated target: up-regulation of leaf senescence
has db xref: GOC:TermGenie

Axiom
annotated source: positive regulation of leaf senescence
annotated property: hasRelatedSynonym
annotated target: upregulation of leaf senescence
has db xref: GOC:TermGenie

regulation of receptor binding
type: Class
equivalent class: Class
  intersection of: biological regulation
  intersection of: Restriction
    on property: RO_0002211
    some values from: signaling receptor binding
subclass of: regulation of protein binding
subclass of: Restriction
  on property: RO_0002211
  some values from: signaling receptor binding
IAO_0000115: Any process that modulates the frequency, rate or extent of a protein or other molecule binding to a receptor.
has narrow synonym: regulation of receptor ligand

Axiom
annotated source: regulation of receptor binding
annotated property: IAO_0000115
annotated target: Any process that modulates the frequency, rate or extent of a protein or other molecule binding to a receptor.
has db xref: GOC:TermGenie
has db xref: GOC:signaling

Axiom
annotated source: regulation of receptor binding
annotated property: hasNarrowSynonym
annotated target: regulation of receptor ligand
has db xref: GOC:TermGenie

positive regulation of receptor binding
type: Class
equivalent class: Class
  intersection of: biological regulation
  intersection of: Restriction
    on property: RO_0002213
    some values from: signaling receptor binding
subclass of: positive regulation of protein binding
subclass of: regulation of receptor binding
subclass of: Restriction
  on property: RO_0002213
  some values from: signaling receptor binding
IAO_0000115: Any process that activates or increases the frequency, rate or extent of a protein or other molecule binding to a receptor.
has exact synonym: up regulation of receptor binding
has exact synonym: upregulation of receptor binding
has narrow synonym: activation of receptor binding

Axiom
annotated source: positive regulation of receptor binding
annotated property: IAO_0000115
annotated target: Any process that activates or increases the frequency, rate or extent of a protein or other molecule binding to a receptor.
has db xref: GOC:TermGenie
has db xref: GOC:signaling

Axiom
annotated source: positive regulation of receptor binding
annotated property: hasExactSynonym
annotated target: up regulation of receptor binding
has db xref: GOC:TermGenie

Axiom
annotated source: positive regulation of receptor binding
annotated property: hasExactSynonym
annotated target: upregulation of receptor binding
has db xref: GOC:TermGenie

Axiom
annotated source: positive regulation of receptor binding
annotated property: hasNarrowSynonym
annotated target: activation of receptor binding
has db xref: GOC:TermGenie

regulation of secondary metabolite biosynthetic process
type: Class
equivalent class: Class
  intersection of: biological regulation
  intersection of: Restriction
    on property: RO_0002211
    some values from: secondary metabolite biosynthetic process
subclass of: regulation of biosynthetic process
subclass of: regulation of secondary metabolic process
subclass of: Restriction
  on property: RO_0002211
  some values from: secondary metabolite biosynthetic process
IAO_0000115: Any process that modulates the frequency, rate or extent of secondary metabolite biosynthetic process.
has exact synonym: regulation of secondary metabolite biosynthesis

Axiom
annotated source: regulation of secondary metabolite biosynthetic process
annotated property: IAO_0000115
annotated target: Any process that modulates the frequency, rate or extent of secondary metabolite biosynthetic process.
has db xref: GOC:TermGenie
has db xref: GOC:di

Axiom
annotated source: regulation of secondary metabolite biosynthetic process
annotated property: hasExactSynonym
annotated target: regulation of secondary metabolite biosynthesis
has db xref: GOC:TermGenie

positive regulation of secondary metabolite biosynthetic process
type: Class
equivalent class: Class
  intersection of: biological regulation
  intersection of: Restriction
    on property: RO_0002213
    some values from: secondary metabolite biosynthetic process
subclass of: positive regulation of biosynthetic process
subclass of: regulation of secondary metabolite biosynthetic process
subclass of: Restriction
  on property: RO_0002213
  some values from: secondary metabolite biosynthetic process
IAO_0000115: Any process that activates or increases the frequency, rate or extent of secondary metabolite biosynthetic process.
has exact synonym: activation of secondary metabolite biosynthesis
has exact synonym: positive regulation of secondary metabolite biosynthesis
has exact synonym: up regulation of secondary metabolite biosynthesis
has exact synonym: up regulation of secondary metabolite biosynthetic process
has exact synonym: up-regulation of secondary metabolite biosynthesis
has exact synonym: up-regulation of secondary metabolite biosynthetic process
has exact synonym: upregulation of secondary metabolite biosynthesis
has exact synonym: upregulation of secondary metabolite biosynthetic process
has narrow synonym: activation of secondary metabolite biosynthetic process

Axiom
annotated source: positive regulation of secondary metabolite biosynthetic process
annotated property: IAO_0000115
annotated target: Any process that activates or increases the frequency, rate or extent of secondary metabolite biosynthetic process.
has db xref: GOC:TermGenie
has db xref: GOC:di

Axiom
annotated source: positive regulation of secondary metabolite biosynthetic process
annotated property: hasExactSynonym
annotated target: activation of secondary metabolite biosynthesis
has db xref: GOC:TermGenie

Axiom
annotated source: positive regulation of secondary metabolite biosynthetic process
annotated property: hasExactSynonym
annotated target: positive regulation of secondary metabolite biosynthesis
has db xref: GOC:TermGenie

Axiom
annotated source: positive regulation of secondary metabolite biosynthetic process
annotated property: hasExactSynonym
annotated target: up regulation of secondary metabolite biosynthesis
has db xref: GOC:TermGenie

Axiom
annotated source: positive regulation of secondary metabolite biosynthetic process
annotated property: hasExactSynonym
annotated target: up regulation of secondary metabolite biosynthetic process
has db xref: GOC:TermGenie

Axiom
annotated source: positive regulation of secondary metabolite biosynthetic process
annotated property: hasExactSynonym
annotated target: up-regulation of secondary metabolite biosynthesis
has db xref: GOC:TermGenie

Axiom
annotated source: positive regulation of secondary metabolite biosynthetic process
annotated property: hasExactSynonym
annotated target: up-regulation of secondary metabolite biosynthetic process
has db xref: GOC:TermGenie

Axiom
annotated source: positive regulation of secondary metabolite biosynthetic process
annotated property: hasExactSynonym
annotated target: upregulation of secondary metabolite biosynthesis
has db xref: GOC:TermGenie

Axiom
annotated source: positive regulation of secondary metabolite biosynthetic process
annotated property: hasExactSynonym
annotated target: upregulation of secondary metabolite biosynthetic process
has db xref: GOC:TermGenie

Axiom
annotated source: positive regulation of secondary metabolite biosynthetic process
annotated property: hasNarrowSynonym
annotated target: activation of secondary metabolite biosynthetic process
has db xref: GOC:TermGenie

regulation of lignin biosynthetic process
type: Class
equivalent class: Class
  intersection of: biological regulation
  intersection of: Restriction
    on property: RO_0002211
    some values from: lignin biosynthetic process
subclass of: regulation of cellular biosynthetic process
subclass of: regulation of secondary metabolite biosynthetic process
subclass of: regulation of phenylpropanoid metabolic process
subclass of: Restriction
  on property: RO_0002211
  some values from: lignin biosynthetic process
IAO_0000115: Any process that modulates the frequency, rate or extent of lignin biosynthetic process.
has exact synonym: regulation of lignin anabolism
has exact synonym: regulation of lignin biosynthesis
has exact synonym: regulation of lignin formation
has exact synonym: regulation of lignin synthesis

Axiom
annotated source: regulation of lignin biosynthetic process
annotated property: IAO_0000115
annotated target: Any process that modulates the frequency, rate or extent of lignin biosynthetic process.
has db xref: GOC:TermGenie

Axiom
annotated source: regulation of lignin biosynthetic process
annotated property: hasExactSynonym
annotated target: regulation of lignin anabolism
has db xref: GOC:TermGenie

Axiom
annotated source: regulation of lignin biosynthetic process
annotated property: hasExactSynonym
annotated target: regulation of lignin biosynthesis
has db xref: GOC:TermGenie

Axiom
annotated source: regulation of lignin biosynthetic process
annotated property: hasExactSynonym
annotated target: regulation of lignin formation
has db xref: GOC:TermGenie

Axiom
annotated source: regulation of lignin biosynthetic process
annotated property: hasExactSynonym
annotated target: regulation of lignin synthesis
has db xref: GOC:TermGenie

organic cyclic compound metabolic process
type: Class
subclass of: organic substance metabolic process
IAO_0000115: The chemical reactions and pathways involving organic cyclic compound.
has exact synonym: organic cyclic compound metabolism

Axiom
annotated source: organic cyclic compound metabolic process
annotated property: IAO_0000115
annotated target: The chemical reactions and pathways involving organic cyclic compound.
has db xref: GOC:TermGenie

Axiom
annotated source: organic cyclic compound metabolic process
annotated property: hasExactSynonym
annotated target: organic cyclic compound metabolism
has db xref: GOC:TermGenie

organic cyclic compound biosynthetic process
type: Class
subclass of: organic cyclic compound metabolic process
subclass of: organic substance biosynthetic process
IAO_0000115: The chemical reactions and pathways resulting in the formation of organic cyclic compound.
has exact synonym: organic cyclic compound anabolism
has exact synonym: organic cyclic compound biosynthesis
has exact synonym: organic cyclic compound formation
has exact synonym: organic cyclic compound synthesis

Axiom
annotated source: organic cyclic compound biosynthetic process
annotated property: IAO_0000115
annotated target: The chemical reactions and pathways resulting in the formation of organic cyclic compound.
has db xref: GOC:TermGenie

Axiom
annotated source: organic cyclic compound biosynthetic process
annotated property: hasExactSynonym
annotated target: organic cyclic compound anabolism
has db xref: GOC:TermGenie

Axiom
annotated source: organic cyclic compound biosynthetic process
annotated property: hasExactSynonym
annotated target: organic cyclic compound biosynthesis
has db xref: GOC:TermGenie

Axiom
annotated source: organic cyclic compound biosynthetic process
annotated property: hasExactSynonym
annotated target: organic cyclic compound formation
has db xref: GOC:TermGenie

Axiom
annotated source: organic cyclic compound biosynthetic process
annotated property: hasExactSynonym
annotated target: organic cyclic compound synthesis
has db xref: GOC:TermGenie

organic substance biosynthetic process
type: Class
subclass of: biosynthetic process
subclass of: organic substance metabolic process
IAO_0000115: The chemical reactions and pathways resulting in the formation of an organic substance, any molecular entity containing carbon.
has exact synonym: organic molecular entity anabolism
has exact synonym: organic molecular entity biosynthesis
has exact synonym: organic molecular entity biosynthetic process
has exact synonym: organic molecular entity formation
has exact synonym: organic molecular entity synthesis
has exact synonym: organic substance anabolism
has exact synonym: organic substance biosynthesis
has exact synonym: organic substance formation
has exact synonym: organic substance synthesis

Axiom
annotated source: organic substance biosynthetic process
annotated property: IAO_0000115
annotated target: The chemical reactions and pathways resulting in the formation of an organic substance, any molecular entity containing carbon.
has db xref: GOC:TermGenie
has db xref: GOC:pr

Axiom
annotated source: organic substance biosynthetic process
annotated property: hasExactSynonym
annotated target: organic molecular entity anabolism
has db xref: GOC:TermGenie

Axiom
annotated source: organic substance biosynthetic process
annotated property: hasExactSynonym
annotated target: organic molecular entity biosynthesis
has db xref: GOC:TermGenie

Axiom
annotated source: organic substance biosynthetic process
annotated property: hasExactSynonym
annotated target: organic molecular entity formation
has db xref: GOC:TermGenie

Axiom
annotated source: organic substance biosynthetic process
annotated property: hasExactSynonym
annotated target: organic molecular entity synthesis
has db xref: GOC:TermGenie

meiotic cell cycle process
type: Class
equivalent class: Class
  intersection of: cellular process
  intersection of: Restriction
    on property: BFO_0000050
    some values from: meiotic cell cycle
subclass of: cell cycle process
subclass of: reproductive process
subclass of: Restriction
  on property: BFO_0000050
  some values from: meiotic cell cycle
disjoint with: mitotic cell cycle process
IAO_0000115: A process that is part of the meiotic cell cycle.

Axiom
annotated source: meiotic cell cycle process
annotated property: IAO_0000115
annotated target: A process that is part of the meiotic cell cycle.
has db xref: GOC:TermGenie
has db xref: GOC:mtg_cell_cycle
has db xref: GO_REF:0000060

mitotic cell cycle process
type: Class
equivalent class: Class
  intersection of: cellular process
  intersection of: Restriction
    on property: BFO_0000050
    some values from: mitotic cell cycle
subclass of: cell cycle process
subclass of: Restriction
  on property: BFO_0000050
  some values from: mitotic cell cycle
IAO_0000115: A process that is part of the mitotic cell cycle.

Axiom
annotated source: mitotic cell cycle process
annotated property: IAO_0000115
annotated target: A process that is part of the mitotic cell cycle.
has db xref: GOC:TermGenie
has db xref: GOC:mtg_cell_cycle
has db xref: GO_REF:0000060

positive regulation of respiratory gaseous exchange
type: Class
equivalent class: Class
  intersection of: biological regulation
  intersection of: Restriction
    on property: RO_0002213
    some values from: respiratory gaseous exchange by respiratory system
subclass of: regulation of respiratory gaseous exchange
subclass of: positive regulation of multicellular organismal process
subclass of: Restriction
  on property: RO_0002213
  some values from: respiratory gaseous exchange by respiratory system
IAO_0000115: Any process that activates or increases the frequency, rate or extent of respiratory gaseous exchange.
has exact synonym: up regulation of respiratory gaseous exchange
has exact synonym: up-regulation of respiratory gaseous exchange
has exact synonym: upregulation of respiratory gaseous exchange
has narrow synonym: activation of respiratory gaseous exchange

Axiom
annotated source: positive regulation of respiratory gaseous exchange
annotated property: IAO_0000115
annotated target: Any process that activates or increases the frequency, rate or extent of respiratory gaseous exchange.
has db xref: GOC:TermGenie
has db xref: GO_REF:0000058
has db xref: PMID:22819705

Axiom
annotated source: positive regulation of respiratory gaseous exchange
annotated property: hasExactSynonym
annotated target: up regulation of respiratory gaseous exchange
has db xref: GOC:TermGenie

Axiom
annotated source: positive regulation of respiratory gaseous exchange
annotated property: hasExactSynonym
annotated target: up-regulation of respiratory gaseous exchange
has db xref: GOC:TermGenie

Axiom
annotated source: positive regulation of respiratory gaseous exchange
annotated property: hasExactSynonym
annotated target: upregulation of respiratory gaseous exchange
has db xref: GOC:TermGenie

Axiom
annotated source: positive regulation of respiratory gaseous exchange
annotated property: hasNarrowSynonym
annotated target: activation of respiratory gaseous exchange
has db xref: GOC:TermGenie

positive regulation of leaf development
type: Class
equivalent class: Class
  intersection of: biological regulation
  intersection of: Restriction
    on property: RO_0002213
    some values from: leaf development
subclass of: positive regulation of developmental process
subclass of: positive regulation of multicellular organismal process
subclass of: regulation of leaf development
subclass of: Restriction
  on property: RO_0002213
  some values from: leaf development
IAO_0000115: Any process that activates or increases the frequency, rate or extent of leaf development.
has exact synonym: up regulation of leaf development
has exact synonym: up-regulation of leaf development
has exact synonym: upregulation of leaf development
has narrow synonym: activation of leaf development

Axiom
annotated source: positive regulation of leaf development
annotated property: IAO_0000115
annotated target: Any process that activates or increases the frequency, rate or extent of leaf development.
has db xref: GOC:TermGenie
has db xref: GO_REF:0000058
has db xref: PMID:11606552

Axiom
annotated source: positive regulation of leaf development
annotated property: hasExactSynonym
annotated target: up regulation of leaf development
has db xref: GOC:TermGenie

Axiom
annotated source: positive regulation of leaf development
annotated property: hasExactSynonym
annotated target: up-regulation of leaf development
has db xref: GOC:TermGenie

Axiom
annotated source: positive regulation of leaf development
annotated property: hasExactSynonym
annotated target: upregulation of leaf development
has db xref: GOC:TermGenie

Axiom
annotated source: positive regulation of leaf development
annotated property: hasNarrowSynonym
annotated target: activation of leaf development
has db xref: GOC:TermGenie

regulation of leaf development
type: Class
equivalent class: Class
  intersection of: biological regulation
  intersection of: Restriction
    on property: RO_0002211
    some values from: leaf development
subclass of: regulation of developmental process
subclass of: Restriction
  on property: RO_0002211
  some values from: leaf development
IAO_0000115: Any process that modulates the frequency, rate or extent of leaf development.

Axiom
annotated source: regulation of leaf development
annotated property: IAO_0000115
annotated target: Any process that modulates the frequency, rate or extent of leaf development.
has db xref: GOC:obol

regulation of multicellular organismal development
type: Class
equivalent class: Class
  intersection of: biological regulation
  intersection of: Restriction
    on property: RO_0002211
    some values from: multicellular organism development
subclass of: regulation of developmental process
subclass of: regulation of multicellular organismal process
subclass of: Restriction
  on property: RO_0002211
  some values from: multicellular organism development
IAO_0000115: Any process that modulates the frequency, rate or extent of multicellular organismal development.

Axiom
annotated source: regulation of multicellular organismal development
annotated property: IAO_0000115
annotated target: Any process that modulates the frequency, rate or extent of multicellular organismal development.
has db xref: GOC:obol

regulation of reproductive process
type: Class
equivalent class: Class
  intersection of: biological regulation
  intersection of: Restriction
    on property: RO_0002211
    some values from: reproductive process
subclass of: regulation of biological process
subclass of: Restriction
  on property: RO_0002211
  some values from: reproductive process
IAO_0000115: Any process that modulates the frequency, rate or extent of reproductive process.

Axiom
annotated source: regulation of reproductive process
annotated property: IAO_0000115
annotated target: Any process that modulates the frequency, rate or extent of reproductive process.
has db xref: GOC:mah

positive regulation of reproductive process
type: Class
equivalent class: Class
  intersection of: biological regulation
  intersection of: Restriction
    on property: RO_0002213
    some values from: reproductive process
subclass of: positive regulation of biological process
subclass of: regulation of reproductive process
subclass of: Restriction
  on property: RO_0002213
  some values from: reproductive process
IAO_0000115: Any process that activates or increases the frequency, rate or extent of reproductive process.

Axiom
annotated source: positive regulation of reproductive process
annotated property: IAO_0000115
annotated target: Any process that activates or increases the frequency, rate or extent of reproductive process.
has db xref: GOC:mah

positive regulation of signaling receptor activity
type: Class
equivalent class: Class
  intersection of: biological regulation
  intersection of: Restriction
    on property: RO_0002213
    some values from: signaling receptor activity
subclass of: regulation of signaling receptor activity
subclass of: positive regulation of molecular function
subclass of: Restriction
  on property: RO_0002213
  some values from: signaling receptor activity
IAO_0000115: Any process that activates or increases the frequency, rate or extent of signaling receptor activity.
has exact synonym: positive regulation of signalling receptor activity

Axiom
annotated source: positive regulation of signaling receptor activity
annotated property: IAO_0000115
annotated target: Any process that activates or increases the frequency, rate or extent of signaling receptor activity.
has db xref: GOC:obol

regulation of root development
type: Class
equivalent class: Class
  intersection of: biological regulation
  intersection of: Restriction
    on property: RO_0002211
    some values from: root development
subclass of: regulation of developmental process
subclass of: Restriction
  on property: RO_0002211
  some values from: root development
IAO_0000115: Any process that modulates the frequency, rate or extent of root development.

Axiom
annotated source: regulation of root development
annotated property: IAO_0000115
annotated target: Any process that modulates the frequency, rate or extent of root development.
has db xref: GOC:obol

regulation of phenylpropanoid metabolic process
type: Class
equivalent class: Class
  intersection of: biological regulation
  intersection of: Restriction
    on property: RO_0002211
    some values from: phenylpropanoid metabolic process
subclass of: regulation of cellular metabolic process
subclass of: regulation of secondary metabolic process
subclass of: Restriction
  on property: RO_0002211
  some values from: phenylpropanoid metabolic process
IAO_0000115: Any process that modulates the frequency, rate or extent of phenylpropanoid metabolic process.
has exact synonym: regulation of phenylpropanoid metabolism

Axiom
annotated source: regulation of phenylpropanoid metabolic process
annotated property: IAO_0000115
annotated target: Any process that modulates the frequency, rate or extent of phenylpropanoid metabolic process.
has db xref: GOC:obol

Axiom
annotated source: regulation of phenylpropanoid metabolic process
annotated property: hasExactSynonym
annotated target: regulation of phenylpropanoid metabolism
has db xref: GOC:obol